2,6,11-Dodecatrienal, 2,6-dimethyl-10-methylene-
- Formula: C15H22O
- Molecular weight: 218.3346
- IUPAC Standard InChIKey: NOPLRNXKHZRXHT-YFVJMOTDSA-N
- CAS Registry Number: 60066-88-8
- Chemical structure:
View 3d structure (requires JavaScript / HTML 5) - Other names: 2,6-Dimethyl-10-methylene-2,6,11-dodecatrienal; 2,6-Dimethyl-10-methylenedodeca-2,6,11-trienal; β-Sinensal; 2,6-dimethyl-10-methylenedodeca-2,6,11-trien-1-al

Van Den Dool and Kratz RI, non-polar column, temperature ramp

Column type | Active phase | I | Reference | Comment |
---|---|---|---|---|
Capillary | ZB-5 | 1693. | Ruiz Perez-Cacho, Mahattanatawee, et al., 2007 | 30. m/0.32 mm/0.5 μm, He, 7. K/min, 265. C @ 5. min; Tstart: 40. C |
Capillary | DB-1 | 1664. | Gancel, Ollitrault, et al., 2005 | 30. m/0.25 mm/0.25 μm, He, 3. K/min, 250. C @ 20. min; Tstart: 40. C |
Capillary | ZB-5 | 1677. | Bell, 2004 | 30. m/0.32 mm/0.50 μm, Helium, 7. K/min, 265. C @ 5. min; Tstart: 40. C |
Capillary | ZB-5 | 1707. | Gocmen, Gurbuz, et al., 2004 | 0. m/0.32 mm/0.5 μm, 7. K/min, 265. C @ 5. min; Tstart: 40. C |
Capillary | SPB-1 | 1661. | Chisholm, Jell, et al., 2003 | 30. m/0.25 mm/0.25 μm, He, 35. C @ 5. min, 4. K/min, 225. C @ 20. min |
Capillary | SPB-1 | 1671. | Chisholm, Jell, et al., 2003 | 30. m/0.25 mm/0.25 μm, He, 35. C @ 5. min, 4. K/min, 225. C @ 20. min |
Capillary | DB-1 | 1664. | Gancel, Ollitrault, et al., 2003 | 30. m/0.25 mm/0.25 μm, He, 3. K/min, 250. C @ 20. min; Tstart: 40. C |
Capillary | DB-5 | 1706. | Högnadóttir and Rouseff, 2003 | 30. m/0.32 mm/0.5 μm, 7. K/min, 265. C @ 5. min; Tstart: 40. C |
Capillary | DB-5 | 1700. | Högnadóttir and Rouseff, 2003 | 30. m/0.32 mm/0.5 μm, 7. K/min, 265. C @ 5. min; Tstart: 40. C |
Capillary | BP-1 | 1673. | Lota, de Rocca Serra, et al., 2002 | 50. m/0.22 mm/0.25 μm, He, 2. K/min, 220. C @ 20. min; Tstart: 60. C |
Capillary | DB-1 | 1668. | Lin and Rouseff, 2001 | 30. m/0.32 mm/0.25 μm, 7. K/min, 240. C @ 5. min; Tstart: 40. C |
Capillary | HP-5 | 1695. | Alonzo, Bosco, et al., 2000 | 30. m/0.20 mm/0.25 μm, He, 60. C @ 8. min, 4. K/min, 180. C @ 2. min |
Capillary | BP-1 | 1673. | Lota, de Rocca Serra, et al., 2000 | 50. m/0.22 mm/0.25 μm, He, 2. K/min, 230. C @ 35. min; Tstart: 60. C |
Capillary | BP-1 | 1673. | Lota, de Rocca Serra, et al., 2000 | 50. m/0.22 mm/0.25 μm, He, 2. K/min, 230. C @ 35. min; Tstart: 60. C |
Capillary | Mega 5MS | 1685. | Verzera, Trozzi, et al., 2000 | 30. m/0.25 mm/0.25 μm, He, 40. C @ 2. min, 3. K/min; Tend: 240. C |
Capillary | OV-101 | 1671. | Yang, Sugisawa, et al., 1992 | N2, 2. K/min; Column length: 50. m; Column diameter: 0.25 mm; Tstart: 80. C; Tend: 200. C |
Capillary | OV-101 | 1672. | Yang, Sugisawa, et al., 1992 | N2, 2. K/min; Column length: 50. m; Column diameter: 0.25 mm; Tstart: 80. C; Tend: 200. C |

Van Den Dool and Kratz RI, non-polar column, custom temperature program

Column type | Active phase | I | Reference | Comment |
---|---|---|---|---|
Capillary | HP-5MS | 1702.5 | Andriamaharavo, 2014 | 30. m/0.25 mm/0.25 μm, He; Program: 60C (1 min) => 5 C/min => 210C => 10 C/min => 280C (15 min) |
Capillary | ZB-5 | 1706. | Bell, 2004 | 30. m/0.32 mm/0.50 μm, Helium; Program: not specified |

Van Den Dool and Kratz RI, polar column, temperature ramp

Column type | Active phase | I | Reference | Comment |
---|---|---|---|---|
Capillary | DB-Wax | 2250. | Ruiz Perez-Cacho, Mahattanatawee, et al., 2007 | 30. m/0.32 mm/0.5 μm, He, 7. K/min, 240. C @ 5. min; Tstart: 40. C |
Capillary | DB-Wax | 2238. | Choi, 2005 | 60. m/0.25 mm/0.25 μm, N2, 70. C @ 2. min, 2. K/min, 230. C @ 20. min |
Capillary | DB-Wax | 2200. | Gancel, Ollitrault, et al., 2005 | 30. m/0.25 mm/0.25 μm, He, 3. K/min, 250. C @ 20. min; Tstart: 40. C |
Capillary | DB-Wax | 2249. | Njoroge, Koaze, et al., 2005 | 60. m/0.25 mm/0.25 μm, N2, 70. C @ 2. min, 2. K/min, 230. C @ 20. min |
Capillary | DB-Wax | 2254. | Bell, 2004 | 30. m/0.32 mm/0.50 μm, Helium, 7. K/min, 240. C @ 5. min; Tstart: 40. C |
Capillary | Innowax | 2242. | Chisholm, Jell, et al., 2003 | 15. m/0.25 mm/0.25 μm, He, 35. C @ 5. min, 4. K/min, 225. C @ 20. min |
Capillary | DB-Wax | 2200. | Gancel, Ollitrault, et al., 2003 | 60. m/0.32 mm/0.25 μm, H2, 1.5 K/min, 245. C @ 20. min; Tstart: 40. C |
Capillary | DB-Wax | 2249. | Högnadóttir and Rouseff, 2003 | 30. m/0.32 mm/0.5 μm, 7. K/min, 240. C @ 5. min; Tstart: 40. C |
Capillary | BP-20 | 2225. | Lota, de Rocca Serra, et al., 2002 | 50. m/0.22 mm/0.25 μm, He, 2. K/min, 220. C @ 20. min; Tstart: 60. C |
Capillary | DB-Wax | 2244. | Lin and Rouseff, 2001 | 30. m/0.32 mm/0.50 μm, He, 7. K/min, 240. C @ 5. min; Tstart: 40. C |
Capillary | DB-Wax | 2239. | Choi and Sawamura, 2000 | 60. m/0.25 mm/0.25 μm, N2, 70. C @ 2. min, 2. K/min, 230. C @ 20. min |
Capillary | BP-20 | 2225. | Lota, de Rocca Serra, et al., 2000 | 50. m/0.22 mm/0.25 μm, He, 2. K/min, 230. C @ 35. min; Tstart: 60. C |
Capillary | BP-20 | 2225. | Lota, de Rocca Serra, et al., 2000 | 50. m/0.22 mm/0.25 μm, He, 2. K/min, 230. C @ 35. min; Tstart: 60. C |
Capillary | Megawax | 2189. | Verzera, Trozzi, et al., 2000 | 30. m/0.25 mm/0.25 μm, He, 40. C @ 6. min, 2. K/min, 220. C @ 10. min |

Van Den Dool and Kratz RI, polar column, custom temperature program

Column type | Active phase | I | Reference | Comment |
---|---|---|---|---|
Capillary | DB-Wax | 2251. | Elston, Lin, et al., 2005 | Program: not specified |
Capillary | DB-Wax | 2251. | Bell, 2004 | 30. m/0.32 mm/0.50 μm, Helium; Program: not specified |

Normal alkane RI, non-polar column, temperature ramp

Column type | Active phase | I | Reference | Comment |
---|---|---|---|---|
Capillary | DB-5 MS | 1694. | Noudogbessi, Yedomonhan, et al., 2008 | 30. m/0.25 mm/0.25 μm, Helium, 50. C @ 5. min, 5. K/min, 300. C @ 5. min |
Capillary | BP-1 | 1675. | Fanciullino, Tomi, et al., 2006 | 50. m/0.22 mm/0.25 μm, He, 2. K/min, 220. C @ 20. min; Tstart: 60. C |
Capillary | DB-5MS | 1659. | Maronigiu, Piras, et al., 2006 | 30. m/0.25 mm/0.25 μm, He, 3. K/min, 280. C @ 30. min; Tstart: 60. C |
Capillary | HP-5MS | 1695. | Ghasemi, Asghari, et al., 2003 | 30. m/0.25 mm/0.25 μm, He, 4. K/min; Tstart: 60. C; Tend: 280. C |
Capillary | HP-5 | 1695. | Stashenko, Jaramillo, et al., 2003 | 60. m/0.25 mm/0.25 μm, 40. C @ 15. min, 5. K/min; Tend: 250. C |
Capillary | DB-1 | 1658. | Gancel, Ollé, et al., 2002 | 30. m/0.32 mm/0.25 μm, H2, 40. C @ 20. min, 3. K/min; Tend: 245. C |
Capillary | BP-1 | 1673. | Lota, de Rocca Serra, et al., 2001 | 50. m/0.22 mm/0.25 μm, He, 2. K/min, 230. C @ 35. min; Tstart: 60. C |
Capillary | OV-101 | 1672. | Yang, 2001 | N2, 2. K/min; Column length: 50. m; Column diameter: 0.25 mm; Tstart: 80. C; Tend: 200. C |
Capillary | DB-5 | 1691. | Mitiku, Sawamura, et al., 2000 | 30. m/0.22 mm/0.25 μm, N2, 70. C @ 2. min, 4. K/min, 230. C @ 20. min |
Capillary | HP-5 | 1669. | Poiana, Sicari, et al., 1998 | 25. m/0.2 mm/0.33 μm, He, 70. C @ 8. min, 3. K/min, 290. C @ 20. min |
Capillary | OV-101 | 1671. | Tamura, Yang, et al., 1993 | 2. K/min; Column length: 50. m; Column diameter: 0.25 mm; Tstart: 80. C; Tend: 200. C |
Capillary | OV-101 | 1672. | Tamura, Yang, et al., 1993 | 2. K/min; Column length: 50. m; Column diameter: 0.25 mm; Tstart: 80. C; Tend: 200. C |
Capillary | OV-101 | 1671. | Yang and Sugisawa, 1990 | N2, 2. K/min; Column length: 50. m; Column diameter: 0.25 mm; Tstart: 80. C; Tend: 200. C |
Capillary | OV-101 | 1671. | Yang and Sugisawa, 1990 | N2, 2. K/min; Column length: 50. m; Column diameter: 0.25 mm; Tstart: 80. C; Tend: 200. C |
Capillary | OV-101 | 1671. | Sugisawa, Yamamoto, et al., 1989 | N2, 2. K/min; Column length: 50. m; Column diameter: 0.25 mm; Tstart: 80. C; Tend: 200. C |
Capillary | OV-101 | 1671. | Sugisawa, Yang, et al., 1989 | N2, 2. K/min; Column length: 50. m; Column diameter: 0.25 mm; Tstart: 80. C; Tend: 200. C |
Capillary | OV-101 | 1671. | Sugisawa, Yang, et al., 1989 | N2, 2. K/min; Column length: 50. m; Column diameter: 0.25 mm; Tstart: 80. C; Tend: 200. C |

Normal alkane RI, non-polar column, custom temperature program

Column type | Active phase | I | Reference | Comment |
---|---|---|---|---|
Capillary | HP-5MS | 1697. | Takaku, Haber, et al., 2007 | He; Column length: 30. m; Column diameter: 0.25 mm; Program: 40C(10min) => 3C/min => 200C => 2C/min => 220C |
Capillary | SE-54 | 1700. | Buettner, Mestres, et al., 2003 | 30. m/0.32 mm/0.25 μm; Program: 35C (2min) => 40C/min => 50C (2min) => 6C/min => 180C => 10C/min => 230C (10min) |

Normal alkane RI, polar column, temperature ramp

Column type | Active phase | I | Reference | Comment |
---|---|---|---|---|
Capillary | BP-20 | 2228. | Fanciullino, Tomi, et al., 2006 | 50. m/0.22 mm/0.25 μm, He, 2. K/min, 220. C @ 20. min; Tstart: 60. C |
Capillary | DB-Wax | 2249. | Njoroge, Koaze, et al., 2005, 2 | 60. m/0.25 mm/0.25 μm, N2, 70. C @ 2. min, 2. K/min, 230. C @ 20. min |
Capillary | DB-Wax | 2249. | Njoroge, Koaze, et al., 2005, 3 | 60. m/0.25 mm/0.25 μm, N2, 70. C @ 2. min, 2. K/min, 230. C @ 20. min |
Capillary | DB-Wax | 2238. | Choi, 2004 | 60. m/0.25 mm/0.25 μm, N2, 70. C @ 2. min, 2. K/min, 230. C @ 20. min |
Capillary | DB-Wax | 2203. | Gancel, Ollé, et al., 2002 | 60. m/0.32 mm/0.25 μm, H2, 1.5 K/min, 245. C @ 20. min; Tstart: 40. C |
Capillary | DB-Wax | 2237. | Tu, Thanh, et al., 2002 | 60. m/0.25 mm/0.25 μm, N2, 2. K/min; Tstart: 70. C; Tend: 230. C |
Capillary | BP-20 | 2225. | Lota, de Rocca Serra, et al., 2001 | 50. m/0.22 mm/0.25 μm, He, 2. K/min, 230. C @ 35. min; Tstart: 60. C |

Normal alkane RI, polar column, custom temperature program

Column type | Active phase | I | Reference | Comment |
---|---|---|---|---|
Capillary | Innowax FSC | 2237. | Tosun, Kürkcüoglu, et al., 2006 | 60. m/0.25 mm/0.25 μm, He; Program: 60C(10min) => 4C/min => 220C (10min) => 1C/min => 240C |
Capillary | DB-Wax | 2200. | Berlinet, Ducruet, et al., 2005 | 30. m/0.25 mm/0.25 μm, He; Program: not specified |
Capillary | FFAP | 2209. | Buettner, Mestres, et al., 2003 | 30. m/0.32 mm/0.25 μm; Program: 35C (2min) => 40C/min => 60C (2min) => 6C/min => 180C => 10C/min => 230C (10min |

References

Ruiz Perez-Cacho, Mahattanatawee, et al., 2007
Ruiz Perez-Cacho, P.; Mahattanatawee, K.; Smoot, J.M.; Rouseff, R.,
Identification of Sulfur Volatiles in Canned Orange Juices Lacking Orange Flavor,
J. Agric. Food Chem., 2007, 55, 14, 5761-5767, https://doi.org/10.1021/jf0703856
. [all data]
Gancel, Ollitrault, et al., 2005
Gancel, A.-L.; Ollitrault, P.; Froelicher, Y.; Tomi, F.; Jacquemond, C.; Luro, F.; Brillouet, J.-M.,
Leaf volatile compounds of six citrus somatic allotetraploid hybrids originating from various combinations of lime, lemon, citron, sweet orange, and grapefruit,
J. Agric. Food Chem., 2005, 53, 6, 2224-2230, https://doi.org/10.1021/jf048315b
. [all data]
Bell, 2004
Bell, W.A.-M.,
Examination of Aroma Volatiles Formed from Thermal Processing of Florida Reconstituted Grapefruit Juice. A Thesis presented to the graduate school of the university of Florida in partial fulfillment of the requirements for the degree of master of science, 2004. [all data]
Gocmen, Gurbuz, et al., 2004
Gocmen, D.; Gurbuz, O.; Rouseff, R.L.; Smoot, J.M.; Dagdelen, A.F.,
Gas chromatographic-olfactometric characterization of aroma active compounds in sun-dried and vacuum-dried tarhana,
Eur. Food Res. Technol., 2004, 218, 6, 573-578, https://doi.org/10.1007/s00217-004-0913-6
. [all data]
Chisholm, Jell, et al., 2003
Chisholm, M.G.; Jell, J.A.; Cass, D.M., Jr.,
Characterization of the major odorants found in the peel oil of Citrus reticulata Blanco cv. Clementine using gas chromatography-olfactometry,
Flavour Fragr. J., 2003, 18, 4, 275-281, https://doi.org/10.1002/ffj.1188
. [all data]
Gancel, Ollitrault, et al., 2003
Gancel, A.-L.; Ollitrault, P.; Froelicher, Y.; Tomi, F.; Jacquemond, C.; Luro, F.; Brillouet, J.-M.,
Leaf volatile compounds of seven citrus somatic tetraploid hybrids sharing willow leaf mandarin (Citrus deliciosa Ten.) as their common parent,
J. Agric. Food Chem., 2003, 51, 20, 6006-6013, https://doi.org/10.1021/jf0345090
. [all data]
Högnadóttir and Rouseff, 2003
Högnadóttir, Á.; Rouseff, R.L.,
Identification of aroma active compounds in organce essence oil using gas chromatography-olfactometry and gas chromatography-mass spectrometry,
J. Chromatogr. A, 2003, 998, 1-2, 201-211, https://doi.org/10.1016/S0021-9673(03)00524-7
. [all data]
Lota, de Rocca Serra, et al., 2002
Lota, M.-L.; de Rocca Serra, D.; Tomi, F.; Jacquemond, C.; Casanova, J.,
Volatile components of peel and leaf oils of lemon and lime species,
J. Agric. Food Chem., 2002, 50, 4, 796-805, https://doi.org/10.1021/jf010924l
. [all data]
Lin and Rouseff, 2001
Lin, J.; Rouseff, R.L.,
Characterization of aroma-impact compounds in cold-pressed grapefruit oil using time-intensity GC-olfactometry and GC-MS,
Flavour Fragr. J., 2001, 16, 6, 457-463, https://doi.org/10.1002/ffj.1041
. [all data]
Alonzo, Bosco, et al., 2000
Alonzo, G.; Bosco, S.F.D.; Palazzolo, E.; Saiano, F.; Tusa, N.,
Citrus somatic hybrid leaf essential oil,
Flavour Fragr. J., 2000, 15, 4, 258-262, https://doi.org/10.1002/1099-1026(200007/08)15:4<258::AID-FFJ906>3.0.CO;2-F
. [all data]
Lota, de Rocca Serra, et al., 2000
Lota, M.-L.; de Rocca Serra, D.; Tomi, F.; Casanova, J.,
Chemical variability of peel and leaf essential oils of mandarins from Citrus reticulata Blanco,
Biochem. Syst. Ecol., 2000, 28, 1, 61-78, https://doi.org/10.1016/S0305-1978(99)00036-8
. [all data]
Verzera, Trozzi, et al., 2000
Verzera, A.; Trozzi, A.; Cotroneo, A.; Lorenzo, D.; Dellacassa, E.,
Uruguayan essential oil. 12. Composition of Nova and Satsuma mandarin oils,
J. Agric. Food Chem., 2000, 48, 7, 2903-2909, https://doi.org/10.1021/jf990734z
. [all data]
Yang, Sugisawa, et al., 1992
Yang, R.; Sugisawa, H.; Nakatani, H.; Tamura, H.; Takagi, N.,
Comparison of odor quality in peel oils of acid citrus,
Nippon Shokuhin Kogyo Gakkaishi, 1992, 39, 1, 16-24, https://doi.org/10.3136/nskkk1962.39.16
. [all data]
Andriamaharavo, 2014
Andriamaharavo, N.R.,
Retention Data. NIST Mass Spectrometry Data Center., NIST Mass Spectrometry Data Center, 2014. [all data]
Choi, 2005
Choi, H.-S.,
Characteristic odor components of kumquat (Fortunella japonica Swingle) peel oil,
J. Agric. Food Chem., 2005, 53, 5, 1642-1647, https://doi.org/10.1021/jf040324x
. [all data]
Njoroge, Koaze, et al., 2005
Njoroge, S.M.; Koaze, H.; Karanja, P.N.; Sawamura, M.,
Volatile Constituents of Redblush Grapefruit ( Citrus paradisi) and Pummelo ( Citrus grandis) Peel Essential Oils from Kenya,
J. Agric. Food Chem., 2005, 53, 25, 9790-9794, https://doi.org/10.1021/jf051373s
. [all data]
Choi and Sawamura, 2000
Choi, H.-S.; Sawamura, M.,
Composition of the essential oil of Citrus tamurana Hort. ex Tanaka (Hyuganatsu),
J. Agric. Food Chem., 2000, 48, 10, 4868-4873, https://doi.org/10.1021/jf000651e
. [all data]
Elston, Lin, et al., 2005
Elston, A.; Lin, J.; Rouseff, R.,
Determination of the role of valencene in orange oil as a direct contributor to aroma quality,
Flavour Fragr. J., 2005, 20, 4, 381-386, https://doi.org/10.1002/ffj.1578
. [all data]
Noudogbessi, Yedomonhan, et al., 2008
Noudogbessi, J.-P.; Yedomonhan, P.; Sohounhloue, D.C.K.; Chalchat, J.-C.; Figueredo, G.,
Chemical composition of essential oil of syzygium guineense (Willd.) DC. var. guineense (Myrtaceae) from Benin,
Rec. Nat. Prod., 2008, 33-38. [all data]
Fanciullino, Tomi, et al., 2006
Fanciullino, A.-L.; Tomi, F.; Luro, F.; Desjobert, J.M.; Casanova, J.,
Chemical variability of peel and leaf oils of mandarins,
Flavour Fragr. J., 2006, 21, 2, 359-367, https://doi.org/10.1002/ffj.1658
. [all data]
Maronigiu, Piras, et al., 2006
Maronigiu, B.; Piras, A.; Porcedda, S.; Tuveri, E.,
Extraction of Santalum album and Boswellia carterii Birdw. volatile oil by supercritical carbon dioxide: influence of some process parameters,
Flavour Fragr. J., 2006, 21, 4, 718-724, https://doi.org/10.1002/ffj.1718
. [all data]
Ghasemi, Asghari, et al., 2003
Ghasemi, N.; Asghari, G.; Ardakani, M.S.; Siahpoush, A.,
Characterization of volatile constituents from aerial parts of varthemia persica DC (var. persica),
Iran. J. Pharm. Res., 2003, 2, 241-243. [all data]
Stashenko, Jaramillo, et al., 2003
Stashenko, E.E.; Jaramillo, B.E.; Martínez, J.R.,
Comparación de la composición química y de la actividad antioxidante in vitro de los metabolitos secundarios volátiles de plantas de la familia verbenaceae,
Rev. Acad. Colomb. Cienc. Exactas Fis. Nat., 2003, 27, 105, 579-597. [all data]
Gancel, Ollé, et al., 2002
Gancel, A.-L.; Ollé, D.; Ollitrault, P.; Luro, F.; Brillouet, J.-M.,
Leaf and peel volatile compounds of an interspecific citrus somatic hybrid [Citrus aurantifolia (Christm.) Swing. + Citrus paradisi Macfayden],
Flavour Fragr. J., 2002, 17, 6, 416-424, https://doi.org/10.1002/ffj.1119
. [all data]
Lota, de Rocca Serra, et al., 2001
Lota, M.-L.; de Rocca Serra, D.; Tomi, F.; Casanova, J.,
Chemical variability of peel and leaf essential oils of 15 species of mandarins,
Biochem. Syst. Ecol., 2001, 29, 1, 77-104, https://doi.org/10.1016/S0305-1978(00)00029-6
. [all data]
Yang, 2001
Yang, R.,
Volatile compounds in peel oil of Citrus sudachi,
Food Sci. (Beijing), 2001, 22, 3, 71-73. [all data]
Mitiku, Sawamura, et al., 2000
Mitiku, S.B.; Sawamura, M.; Itoh, T.; Ukeda, H.,
Volatile components of peel cold-pressed oils of two cultivars of sweet orange (Citrus sinensis (L.) Osbeck) from Ethiopia,
Flavour Fragr. J., 2000, 15, 4, 240-244, https://doi.org/10.1002/1099-1026(200007/08)15:4<240::AID-FFJ902>3.0.CO;2-F
. [all data]
Poiana, Sicari, et al., 1998
Poiana, M.; Sicari, V.; Mincione, B.,
Supercritical carbon dioxide (SC-CO2) extraction of grapefruit flavedo,
Flavour Fragr. J., 1998, 13, 2, 125-130, https://doi.org/10.1002/(SICI)1099-1026(199803/04)13:2<125::AID-FFJ708>3.0.CO;2-#
. [all data]
Tamura, Yang, et al., 1993
Tamura, H.; Yang, R.-H.; Sugisawa, H.,
Aroma profiles of peel oils of acid citrus,
ACS Sym. Ser., 1993, 525, 121-136. [all data]
Yang and Sugisawa, 1990
Yang, R.; Sugisawa, H.,
Citrus Suachi Hort. ex Shirai. Volatile components in Sudachi (Citrus Sudachi Hort. ex Shirai) juice,
Nippon Shokuhin Kogyo Gakkaishi, 1990, 37, 12, 946-952, https://doi.org/10.3136/nskkk1962.37.12_946
. [all data]
Sugisawa, Yamamoto, et al., 1989
Sugisawa, H.; Yamamoto, M.; Tamura, H.; Takagi, N.,
The comparison of volatile components in peel oil from four species of navel orange,
Nippon Shokuhin Kogio Gakkaishi, 1989, 36, 6, 455-462, https://doi.org/10.3136/nskkk1962.36.6_455
. [all data]
Sugisawa, Yang, et al., 1989
Sugisawa, H.; Yang, R.H.; Kawabata, C.; Tamura, H.,
Volatile constituents in the peel oil of sudachi (Citrus sudachi),
Agric. Biol. Chem., 1989, 53, 6, 1721-1723, https://doi.org/10.1271/bbb1961.53.1721
. [all data]
Takaku, Haber, et al., 2007
Takaku, S.; Haber, W.A.; Setzer, W.N.,
Leaf essential oil composition of 10 species of Ocotea (Lauraceae) from Monteverde, Costa Rica,
Biochem. Syst. Ecol., 2007, 35, 8, 525-532, https://doi.org/10.1016/j.bse.2007.02.003
. [all data]
Buettner, Mestres, et al., 2003
Buettner, A.; Mestres, M.; Fischer, A.; Guasch, J.; Schieberle, P.,
Evaluation of the most odour-active compounds in the peel oil of clementines ( citrus reticulata blanco cv. clementine),
Eur. Food Res. Technol., 2003, 216, 11-14. [all data]
Njoroge, Koaze, et al., 2005, 2
Njoroge, S.M.; Koaze, H.; Mwaniki, M.; Minh Tu, N.T.; Sawamura, M.,
Essential oils of Kenyan Citrus fruits: volatile components of two varieties of mandarins (Citrus reticulata) and a tangelo (C. paradisi × C. tangerina),
Flavour Fragr. J., 2005, 20, 1, 74-79, https://doi.org/10.1002/ffj.1376
. [all data]
Njoroge, Koaze, et al., 2005, 3
Njoroge, S.M.; Koaze, H.; Karanja, P.N.; Sawamura, M.,
Essential oil constituents of three varieties of Kenyan sweet oranges (Citrus sinensis),
Flavour Fragr. J., 2005, 20, 1, 80-85, https://doi.org/10.1002/ffj.1377
. [all data]
Choi, 2004
Choi, H.-S.,
Aroma evaluation of an aquatic herb, changpo (Acorus calamus Var. angustatus Bess), by AEDA and SPME,
J. Agric. Food Chem., 2004, 52, 26, 8099-8104, https://doi.org/10.1021/jf040239p
. [all data]
Tu, Thanh, et al., 2002
Tu, N.T.M.; Thanh, L.X.; Une, A.; Ukeda, H.; Sawamura, M.,
Volatile constituents of Vietnamese pummelo, orange, tangerine and lime peel oils,
Flavour Fragr. J., 2002, 17, 3, 169-174, https://doi.org/10.1002/ffj.1076
. [all data]
Tosun, Kürkcüoglu, et al., 2006
Tosun, A.; Kürkcüoglu, M.; Dogan, E.; Duman, H.; Baser, K.H.C.,
Essential oil composition of Seseli petraeum M. Bieb. and Seseli andronakii Woron. growing in Turkey,
Flavour Fragr. J., 2006, 21, 2, 257-259, https://doi.org/10.1002/ffj.1572
. [all data]
Berlinet, Ducruet, et al., 2005
Berlinet, C.; Ducruet, V.; Brillouet, J.-M.; Reynes, M.; Brat, P.,
Evolution of aroma compounds from orange juice stored in polyethylene terephthalate (PET),
Food Addit. Contam., 2005, 22, 2, 185-195, https://doi.org/10.1080/02652030500037860
. [all data]