3-Pentanol, 2,4-dimethyl-
- Formula: C7H16O
- Molecular weight: 116.2013
- IUPAC Standard InChIKey: BAYAKMPRFGNNFW-UHFFFAOYSA-N
- CAS Registry Number: 600-36-2
- Chemical structure:
View 3d structure (requires JavaScript / HTML 5) - Other names: Diisopropylcarbinol; Diisopropylmethanol; 2,4-Dimethyl-3-hydroxypentane; 2,4-Dimethyl-3-pentanol; 2,4-dimethylpentan-3-ol

Phase change data

Data compiled as indicated in comments:
BS - Robert L. Brown and Stephen E. Stein
TRC - Thermodynamics Research Center, NIST Boulder Laboratories, Chris Muzny director
AC - William E. Acree, Jr., James S. Chickos
Quantity | Value | Units | Method | Reference | Comment |
---|---|---|---|---|---|
Tboil | 411. ± 5. | K | AVG | N/A | Average of 18 values; Individual data points |
Enthalpy of vaporization
ΔvapH (kJ/mol) | Temperature (K) | Method | Reference | Comment |
---|---|---|---|---|
51.8 | 328. | C | Weber and Defibaugh, 1996 | AC |
48.8 | 343. | C | Weber and Defibaugh, 1996 | AC |
45.7 | 358. | C | Weber and Defibaugh, 1996 | AC |
53.6 | 322. | A | Stephenson and Malanowski, 1987 | Based on data from 307. to 412. K. See also Wilhoit and Zwolinski, 1973.; AC |

Reaction thermochemistry data

Data compiled by: John E. Bartmess
Individual Reactions
C7H15O- + =
By formula: C7H15O- + H+ = C7H16O
Quantity | Value | Units | Method | Reference | Comment |
---|---|---|---|---|---|
ΔrH° | 1551. ± 13. | kJ/mol | G+TS | Boand, Houriet, et al., 1983 | gas phase; value altered from reference due to change in acidity scale |
Quantity | Value | Units | Method | Reference | Comment |
ΔrG° | 1523. ± 13. | kJ/mol | CIDC | Boand, Houriet, et al., 1983 | gas phase; value altered from reference due to change in acidity scale |

Gas phase ion energetics data

Data compiled by: John E. Bartmess
De-protonation reactions
C7H15O- + =
By formula: C7H15O- + H+ = C7H16O
Quantity | Value | Units | Method | Reference | Comment |
---|---|---|---|---|---|
ΔrH° | 1551. ± 13. | kJ/mol | G+TS | Boand, Houriet, et al., 1983 | gas phase; value altered from reference due to change in acidity scale |
Quantity | Value | Units | Method | Reference | Comment |
ΔrG° | 1523. ± 13. | kJ/mol | CIDC | Boand, Houriet, et al., 1983 | gas phase; value altered from reference due to change in acidity scale |

Kovats' RI, non-polar column, isothermal

View large format table.

Column type Active phase Temperature (C) I Reference Comment
PackedApiezon L120.820.Bogoslovsky, Anvaer, et al., 1978Celite 545
PackedApiezon L160.831.Bogoslovsky, Anvaer, et al., 1978Celite 545

Van Den Dool and Kratz RI, non-polar column, temperature ramp

View large format table.

Column type Active phase I Reference Comment
CapillaryDB-5827.Rostad and Pereira, 198630. m/0.26 mm/0.25 μm, He, 50. C @ 4. min, 6. K/min, 300. C @ 20. min

Van Den Dool and Kratz RI, non-polar column, custom temperature program

View large format table.

Column type Active phase I Reference Comment
CapillaryVF-5MS838.Tret'yakov, 200730. m/0.25 mm/0.25 μm, He; Program: Multi-step temperature program; T(initial)=60C; T(final)=270C

Normal alkane RI, non-polar column, temperature ramp

View large format table.

Column type Active phase I Reference Comment
CapillaryOV-101828.Anker, Jurs, et al., 19902. K/min; Column length: 50. m; Column diameter: 0.28 mm; Tstart: 80. C; Tend: 200. C

Normal alkane RI, non-polar column, custom temperature program

View large format table.

Column type Active phase I Reference Comment
CapillaryMethyl Silicone821.Feng and Mu, 2007Program: not specified
CapillarySE-30828.Vinogradov, 2004Program: not specified
CapillaryPolydimethyl siloxane821.Junkes, Castanho, et al., 2003Program: not specified
CapillaryMethyl Silicone821.Estrada and Gutierrez, 1999Program: not specified

Normal alkane RI, polar column, isothermal

View large format table.

Column type Active phase Temperature (C) I Reference Comment
PackedPEG100.1220.Dowling, Evans, et al., 1990Phasesep W (10 %)

Normal alkane RI, polar column, temperature ramp

View large format table.

Column type Active phase I Reference Comment
CapillaryCarbowax 20M1157.Anker, Jurs, et al., 19902. K/min; Column length: 80. m; Column diameter: 0.2 mm; Tstart: 70. C; Tend: 170. C

Normal alkane RI, polar column, custom temperature program

View large format table.

Column type Active phase I Reference Comment
CapillaryCarbowax 20M1157.Vinogradov, 2004Program: not specified
CapillarySupelcowax1187.Garneau, Bouhajib, et al., 1994Column length: 30. m; Column diameter: 0.25 mm; Program: not specified

Lee's RI, non-polar column, temperature ramp

View large format table.

Column type Active phase I Reference Comment
CapillaryDB-5132.11Rostad and Pereira, 198630. m/0.26 mm/0.25 μm, He, 50. C @ 4. min, 6. K/min, 300. C @ 20. min

References

Weber and Defibaugh, 1996
Weber, Lloyd A.; Defibaugh, Dana R.,
Vapor Pressure of Pentafluorodimethyl Ether,
J. Chem. Eng. Data, 1996, 41, 3, 382-385, https://doi.org/10.1021/je950217m
. [all data]
Stephenson and Malanowski, 1987
Stephenson, Richard M.; Malanowski, Stanislaw,
Handbook of the Thermodynamics of Organic Compounds, 1987, https://doi.org/10.1007/978-94-009-3173-2
. [all data]
Wilhoit and Zwolinski, 1973
Wilhoit, R.C.; Zwolinski, B.J.,
Physical and thermodynamic properties of aliphatic alcohols,
J. Phys. Chem. Ref. Data Suppl., 1973, 1, 2, 1. [all data]
Boand, Houriet, et al., 1983
Boand, G.; Houriet, R.; Baumann, T.,
The gas phase acidity of aliphatic alcohols,
J. Am. Chem. Soc., 1983, 105, 2203. [all data]