Butane, 2-nitro-
- Formula: C4H9NO2
- Molecular weight: 103.1198
- IUPAC Standard InChIKey: SUGZATOHBPXTDV-UHFFFAOYSA-N
- CAS Registry Number: 600-24-8
- Chemical structure:
- Other names: 2-Nitrobutane; sec-C4H9NO2

Condensed phase thermochemistry data

Data compiled by: Hussein Y. Afeefy, Joel F. Liebman, and Stephen E. Stein
Quantity | Value | Units | Method | Reference | Comment |
---|---|---|---|---|---|
ΔfH°liquid | -207.6 ± 1.5 | kJ/mol | Ccb | Holcomb and Dorsey, 1949 | |
Quantity | Value | Units | Method | Reference | Comment |
ΔcH°liquid | -2652.7 ± 1.5 | kJ/mol | Ccb | Holcomb and Dorsey, 1949 |

Phase change data

Data compiled as indicated in comments:
TRC - Thermodynamics Research Center, NIST Boulder Laboratories, Chris Muzny director
ALS - Hussein Y. Afeefy, Joel F. Liebman, and Stephen E. Stein
AC - William E. Acree, Jr., James S. Chickos
Quantity | Value | Units | Method | Reference | Comment |
---|---|---|---|---|---|
Tboil | 412.8 | K | N/A | Hodge, 1940 | Uncertainty assigned by TRC = 0.7 K; TRC |
Quantity | Value | Units | Method | Reference | Comment |
Tfus | 412.65 | K | N/A | Toops, 1956 | Uncertainty assigned by TRC = 0.07 K; TRC |
Quantity | Value | Units | Method | Reference | Comment |
ΔvapH° | 43.85 ± 0.42 | kJ/mol | V | Holcomb and Dorsey, 1949 | ALS |
Enthalpy of vaporization
ΔvapH (kJ/mol) | Temperature (K) | Method | Reference | Comment |
---|---|---|---|---|
40.3 | 360. | A,EB | Stephenson and Malanowski, 1987 | Based on data from 345. to 413. K. See also Toops, 1956, 2 and Dykyj, 1971.; AC |

Gas phase ion energetics data

Data compiled as indicated in comments:
RDSH - Henry M. Rosenstock, Keith Draxl, Bruce W. Steiner, and John T. Herron

Ionization energy determinations

IE (eV) Method Reference Comment
10.71 ± 0.01PEDewar, Shanshal, et al., 1969RDSH

Kovats' RI, non-polar column, isothermal

View large format table.

Column type Active phase Temperature (C) I Reference Comment
PackedSF-96100.776.Boneva and Dimov, 1979N2; Column length: 2. m
PackedSF-96110.776.Boneva and Dimov, 1979N2; Column length: 2. m
PackedSF-9690.774.Boneva and Dimov, 1979N2; Column length: 2. m

References

Holcomb and Dorsey, 1949
Holcomb, D.E.; Dorsey, C.L., Jr.,
Thermodynamic properties of nitroparaffins,
Ind. Eng. Chem., 1949, 41, 2788-2792. [all data]
Hodge, 1940
Hodge, E.B.,
Vapor pressures for six aliphatic nitro compounds,
Ind. Eng. Chem., 1940, 32, 748. [all data]
Toops, 1956
Toops, E.E.,
Physical Properties of High Purity Nitroparaffins,
J. Phys. Chem., 1956, 60, 304-6. [all data]
Stephenson and Malanowski, 1987
Stephenson, Richard M.; Malanowski, Stanislaw,
Handbook of the Thermodynamics of Organic Compounds, 1987, https://doi.org/10.1007/978-94-009-3173-2
. [all data]
Toops, 1956, 2
Toops, Emory E.,
Physical Properties of Eight High-Purity Nitroparaffins,
J. Phys. Chem., 1956, 60, 3, 304-306, https://doi.org/10.1021/j150537a012
. [all data]
Dykyj, 1971
Dykyj, J.,
Petrochemia, 1971, 11, 2, 27. [all data]