Butanoic acid, 2-methyl-
- Formula: C5H10O2
- Molecular weight: 102.1317
- IUPAC Standard InChIKey: WLAMNBDJUVNPJU-UHFFFAOYSA-N
- CAS Registry Number: 600-07-7
- Chemical structure:
View 3d structure (requires JavaScript / HTML 5) - Species with the same structure:
- Stereoisomers:
- Other names: Butyric acid, 2-methyl-; α-Methylbutyric acid; Active valeric acid; Ethylmethylacetic acid; Methylethylacetic acid; 2-Methylbutanoic acid; 2-Methylbutyric acid; 2-Methybutyric acid; (.+/-.)-2-Methylbutanoic acid; DL-2-Methylbutyric acid; NSC 7304; 600-07-7

Phase change data

Data compiled by: Robert L. Brown and Stephen E. Stein
Quantity | Value | Units | Method | Reference | Comment |
---|---|---|---|---|---|
Tboil | 450.2 | K | N/A | Weast and Grasselli, 1989 |

References

Weast and Grasselli, 1989
CRC Handbook of Data on Organic Compounds, 2nd Editon, Weast,R.C and Grasselli, J.G., ed(s)., CRC Press, Inc., Boca Raton, FL, 1989, 1. [all data]