Benzenesulfonamide, N,N,4-trimethyl-
- Formula: C9H13NO2S
- Molecular weight: 199.270
- IUPAC Standard InChIKey: WZKOKGOAHBIPCI-UHFFFAOYSA-N
- CAS Registry Number: 599-69-9
- Chemical structure:
View 3d structure (requires JavaScript / HTML 5) - Other names: p-Toluenesulfonamide, N,N-dimethyl-; N,N-Dimethyl-p-toluenesulfonamide; N,N,4-Trimethyl-benzenesulfonamide; 4,N,N-Trimethylbenzenesulfonamide; N-[(4-Methylphenyl)sulfonyl]dimethylamine; N,N-dimethyl-p-toluenesulphonamide

Van Den Dool and Kratz RI, non-polar column, temperature ramp

Column type | Active phase | I | Reference | Comment |
---|---|---|---|---|
Capillary | VF-5MS | 1671. | Todua, 2011 | 30. m/0.25 mm/0.25 μm, He; Tstart: 60. C; Tend: 270. C |

References

Todua, 2011
Todua, N.G.,
Retention Data. NIST Mass Spectrometry Data Center., NIST Mass Spectrometry Data Center, 2011. [all data]