24-Methyl-5-α-cholest-22-en-3-β-ol
- Formula: C28H48O
- Molecular weight: 400.6801
- IUPAC Standard InChIKey: PRKPDIRLXGMLSU-WGOAJHFPSA-N
- CAS Registry Number: 59905-70-3
- Chemical structure:
View 3d structure (requires JavaScript / HTML 5) - Permanent link for this species. Use this link for bookmarking this species for future reference.

Kovats' RI, non-polar column, isothermal

Column type | Active phase | Temperature (C) | I | Reference | Comment |
---|---|---|---|---|---|
Capillary | Methyl Silicone | 250. | 3220. | Shlyakhov, 1984 |

References

Shlyakhov, 1984
Shlyakhov, A.F.,
Gas chromatography in organic geochemistry, Nedra, Moscow, 1984, 221. [all data]