Octanal, 3,7-dimethyl-
- Formula: C10H20O
- Molecular weight: 156.2652
- IUPAC Standard InChIKey: UCSIFMPORANABL-UHFFFAOYSA-N
- CAS Registry Number: 5988-91-0
- Chemical structure:
View 3d structure (requires JavaScript / HTML 5) - Other names: Tetrahydrocitral; 3,7-dimethyloctanal

Kovats' RI, non-polar column, isothermal

Column type | Active phase | Temperature (C) | I | Reference | Comment |
---|---|---|---|---|---|
Capillary | SE-30 | 100. | 1156.0 | Tudor, 1997 | 40. m/0.35 mm/0.35 μm |

References

Tudor, 1997
Tudor, E.,
Temperature dependence of the retention index for perfumery compounds on a SE-30 glass capillary column. I. Linear equations,
J. Chromatogr. A, 1997, 779, 1-2, 287-297, https://doi.org/10.1016/S0021-9673(97)00453-6
. [all data]