Propane, 1,1,2-trichloro-
- Formula: C3H5Cl3
- Molecular weight: 147.431
- IUPAC Standard InChIKey: GRSQYISVQKPZCW-UHFFFAOYSA-N
- CAS Registry Number: 598-77-6
- Chemical structure:
View 3d structure (requires JavaScript / HTML 5) - Other names: 1,1,2-Trichloropropane

Phase change data

Data compiled by: Thermodynamics Research Center, NIST Boulder Laboratories, Chris Muzny director
Quantity | Value | Units | Method | Reference | Comment |
---|---|---|---|---|---|
Tboil | 407. ± 6. | K | AVG | N/A | Average of 6 values; Individual data points |

Normal alkane RI, non-polar column, custom temperature program

View large format table.

Column type Active phase I Reference Comment
CapillaryOV-1, SE-30, Methyl silicone, SP-2100, OV-101, DB-1, etc.827.Waggott and Davies, 1984Hydrogen; Column length: 50. m; Column diameter: 0.32 mm; Program: not specified

References

No reference data available.