occidol
- Formula: C15H22O
- Molecular weight: 218.3346
- IUPAC Standard InChIKey: AFBBWQXTLZVDEE-UHFFFAOYSA-N
- CAS Registry Number: 5986-36-7
- Chemical structure:
View 3d structure (requires JavaScript / HTML 5) - Other names: occidol isomer 1; occidol isomer 2; Ossidol

Kovats' RI, non-polar column, temperature ramp

Column type | Active phase | I | Reference | Comment |
---|---|---|---|---|
Capillary | DB-5 | 1824. | Andersen, Gagnon, et al., 1995 | 2. K/min; Tstart: 40. C; Tend: 210. C |
Capillary | DB-5 | 1832. | Andersen, Gagnon, et al., 1995 | 2. K/min; Tstart: 40. C; Tend: 210. C |
Capillary | DB-5 | 1860. | Andersen, Gagnon, et al., 1995 | 2. K/min; Tstart: 40. C; Tend: 210. C |

Kovats' RI, polar column, temperature ramp

Column type | Active phase | I | Reference | Comment |
---|---|---|---|---|
Capillary | Supelcowax-10 | 2653. | Andersen, Gagnon, et al., 1995 | 2. K/min; Tstart: 40. C; Tend: 210. C |
Capillary | Supelcowax-10 | 2658. | Andersen, Gagnon, et al., 1995 | 2. K/min; Tstart: 40. C; Tend: 210. C |

Van Den Dool and Kratz RI, non-polar column, temperature ramp

Column type | Active phase | I | Reference | Comment |
---|---|---|---|---|
Capillary | HP-5MS | 1832. | Demetzos, Angelopoulou, et al., 2002 | 30. m/0.25 mm/0.25 μm, 50. C @ 5. min, 3. K/min; Tend: 280. C |

Normal alkane RI, non-polar column, temperature ramp

Column type | Active phase | I | Reference | Comment |
---|---|---|---|---|
Capillary | HP-5 MS | 1844. | Pripdeevech and Saansoomchai, 2013 | 30. m/0.25 mm/0.25 μm, Helium, 3. K/min; Tstart: 60. C; Tend: 230. C |
Capillary | DB-5MS | 1794. | Marongiu, Piras, et al., 2005 | 30. m/0.25 mm/0.25 μm, He, 60. C @ 30. min, 3. K/min; Tend: 280. C |

Normal alkane RI, non-polar column, custom temperature program

Column type | Active phase | I | Reference | Comment |
---|---|---|---|---|
Capillary | SE-30 | 1822. | Vinogradov, 2004 | Program: not specified |
Capillary | Polydimethyl siloxanes | 1822. | Zenkevich, 1997 | Program: not specified |

References

Andersen, Gagnon, et al., 1995
Andersen, A.; Gagnon, H.; Collin, G.; Adams, R.P.,
Essential oil of the wood of Thuja occidentalis L.,
J. Essent. Oil Res., 1995, 7, 5, 489-495, https://doi.org/10.1080/10412905.1995.9698572
. [all data]
Demetzos, Angelopoulou, et al., 2002
Demetzos, C.; Angelopoulou, D.; Perdetzoglou, D.,
A comparative study of the essential oils of Cistus salviifolius in several populations of Crete (Greece),
Biochem. Syst. Ecol., 2002, 30, 7, 651-665, https://doi.org/10.1016/S0305-1978(01)00145-4
. [all data]
Pripdeevech and Saansoomchai, 2013
Pripdeevech, P.; Saansoomchai, J.,
Antibacterial activity and chemical composition of essential oil and various extracts of Fagraea fragrans Roxb. flowers,
Chiang Mai J. Sci., 2013, 40, 2, 214-223. [all data]
Marongiu, Piras, et al., 2005
Marongiu, B.; Piras, A.; Porcedda, S.; Scorciapino, A.,
Chemical composition of the essential oil and supercritical CO2 extract of Commiphora myrrha (Nees) Engl. and of Acorus calamus L.,
J. Agric. Food Chem., 2005, 53, 20, 7939-7943, https://doi.org/10.1021/jf051100x
. [all data]
Vinogradov, 2004
Vinogradov, B.A.,
Production, composition, properties and application of essential oils, 2004, retrieved from http://viness.narod.ru. [all data]
Zenkevich, 1997
Zenkevich, I.G.,
Analytical Parameters of Components of Essential Oils for their Chromatographic and Chromato-Spectral Identificaiton. Oxsigenated derivatives of Mono- and Sesquiterpene Hydrocarbons,
Rastit, Resursy (Rus.), 1997, 33, 1, 16-28. [all data]