1,1-Difluoro-1-iodoethane
- Formula: C2H3F2I
- Molecular weight: 191.9465
- IUPAC Standard InChIKey: LBRHUMBEGYYRBE-UHFFFAOYSA-N
- CAS Registry Number: 598-39-0
- Chemical structure:
View 3d structure (requires JavaScript / HTML 5) - Permanent link for this species. Use this link for bookmarking this species for future reference.

Gas phase thermochemistry data

Data compiled by: Hussein Y. Afeefy, Joel F. Liebman, and Stephen E. Stein
Quantity | Value | Units | Method | Reference | Comment |
---|---|---|---|---|---|
ΔfH°gas | -410.0 ± 8.5 | kJ/mol | Kin | Pickard and Rodgers, 1977 | Reanalyzed by Kolesov and Papina, 1983, Original value = -411. ± 6.3 kJ/mol; Equilibration |

References

Pickard and Rodgers, 1977
Pickard, J.M.; Rodgers, A.S.,
The kinetics and equilibrium of the gas-phase reaction CH3CF2Br + I2 = IBr + CH3CF2I. The C-Br bond issociation energy in 1,1-difluorobromoethane,
Int. J. Chem. Kinet., 1977, 9, 759-767. [all data]
Kolesov and Papina, 1983
Kolesov, V.P.; Papina, T.S.,
Thermochemistry of Haloethanes,
Russ. Chem. Rev., 1983, 52, 425. [all data]