1,2-Diiodopropane
- Formula: C3H6I2
- Molecular weight: 295.8887
- IUPAC Standard InChIKey: ISXPOEJSKALLKA-UHFFFAOYSA-N
- CAS Registry Number: 598-29-8
- Chemical structure:
View 3d structure (requires JavaScript / HTML 5) - Permanent link for this species. Use this link for bookmarking this species for future reference.

Gas phase thermochemistry data

Data compiled by: Hussein Y. Afeefy, Joel F. Liebman, and Stephen E. Stein
Quantity | Value | Units | Method | Reference | Comment |
---|---|---|---|---|---|
ΔfH°gas | 35.6 ± 3.4 | kJ/mol | Eqk | Benson and Amano, 1962 | Reanalyzed by Cox and Pilcher, 1970, Original value = 36. ± 2. kJ/mol |

Reaction thermochemistry data

Data compiled by: Hussein Y. Afeefy, Joel F. Liebman, and Stephen E. Stein
Individual Reactions
By formula: C3H6I2 = C3H6 + I2
Quantity | Value | Units | Method | Reference | Comment |
---|---|---|---|---|---|
ΔrH° | 47. ± 2. | kJ/mol | Eqk | Benson and Amano, 1962 | gas phase |

References

Benson and Amano, 1962
Benson, S.W.; Amano, A.,
Thermodynamics of iodine addition to ethylene, propylene, and cyclopropane,
J. Chem. Phys., 1962, 36, 3464-3471. [all data]
Cox and Pilcher, 1970
Cox, J.D.; Pilcher, G.,
Thermochemistry of Organic and Organometallic Compounds, Academic Press, New York, 1970, 1-636. [all data]