Propionyl bromide
- Formula: C3H5BrO
- Molecular weight: 136.975
- IUPAC Standard InChIKey: RIBFXMJCUYXJDZ-UHFFFAOYSA-N
- CAS Registry Number: 598-22-1
- Chemical structure:

Phase change data

Data compiled as indicated in comments:
BS - Robert L. Brown and Stephen E. Stein
TRC - Thermodynamics Research Center, NIST Boulder Laboratories, Chris Muzny director
Quantity | Value | Units | Method | Reference | Comment |
---|---|---|---|---|---|
Tboil | 376.7 | K | N/A | Aldrich Chemical Company Inc., 1990 | BS |
Tboil | 372. | K | N/A | Yamase, 1961 | Uncertainty assigned by TRC = 4. K; TRC |

References

Aldrich Chemical Company Inc., 1990
Aldrich Chemical Company Inc.,
Catalog Handbook of Fine Chemicals, Aldrich Chemical Company, Inc., Milwaukee WI, 1990, 1. [all data]
Yamase, 1961
Yamase, Y.,
Friedel-Crafts Acylation II. Relative Reactivity for Some Acyl Halides,
Bull. Chem. Soc. Jpn., 1961, 34, 480-84. [all data]