Propane, 1,1'-sulfonylbis-
- Formula: C6H14O2S
- Molecular weight: 150.239
- IUPAC Standard InChIKey: JEXYCADTAFPULN-UHFFFAOYSA-N
- CAS Registry Number: 598-03-8
- Chemical structure:
View 3d structure (requires JavaScript / HTML 5) - Other names: Propyl sulfone; Dipropyl sulfone; Dipropyl sulphone; 1,1'-Sulphonylbispropane; Di-n-propyl sulfone; n-Propyl sulfone

Gas phase thermochemistry data

Data compiled by: Hussein Y. Afeefy, Joel F. Liebman, and Stephen E. Stein
Quantity | Value | Units | Method | Reference | Comment |
---|---|---|---|---|---|
ΔfH°gas | -468.3 ± 2.6 | kJ/mol | Ccb | Mackle and O'Hare, 1961 | Reanalyzed by Cox and Pilcher, 1970, Original value = -467. ± 2. kJ/mol; Heat of combustion corrected for constant pressure |

Condensed phase thermochemistry data

Data compiled by: Hussein Y. Afeefy, Joel F. Liebman, and Stephen E. Stein
Quantity | Value | Units | Method | Reference | Comment |
---|---|---|---|---|---|
ΔfH°liquid | -548.19 ± 0.84 | kJ/mol | Ccb | Mackle and O'Hare, 1961 | Reanalyzed by Cox and Pilcher, 1970, Original value = -546.6 ± 0.8 kJ/mol; Heat of combustion corrected for constant pressure |
Quantity | Value | Units | Method | Reference | Comment |
ΔcH°liquid | -4416.00 ± 0.63 | kJ/mol | Ccb | Mackle and O'Hare, 1961 | Reanalyzed by Cox and Pilcher, 1970, Original value = -4417.2 ± 0.4 kJ/mol; Heat of combustion corrected for constant pressure |

Phase change data

Data compiled as indicated in comments:
TRC - Thermodynamics Research Center, NIST Boulder Laboratories, Chris Muzny director
ALS - Hussein Y. Afeefy, Joel F. Liebman, and Stephen E. Stein
Quantity | Value | Units | Method | Reference | Comment |
---|---|---|---|---|---|
Tboil | 542. | K | N/A | Lee, 1986 | Uncertainty assigned by TRC = 3. K; TRC |
Quantity | Value | Units | Method | Reference | Comment |
Tfus | 302. ± 2. | K | AVG | N/A | Average of 6 values; Individual data points |
Quantity | Value | Units | Method | Reference | Comment |
ΔvapH° | 80. ± 2. | kJ/mol | V | Mackle and O'Hare, 1961 | Heat of combustion corrected for constant pressure; ALS |

References

Mackle and O'Hare, 1961
Mackle, H.; O'Hare, P.A.G.,
Studies in the thermochemistry of sulphones. Part 5.-Heats of combustion, formation, fusion, vaporization and atomization of eleven aliphatic sulphones,
Trans. Faraday Soc., 1961, 57, 1070-1074. [all data]
Cox and Pilcher, 1970
Cox, J.D.; Pilcher, G.,
Thermochemistry of Organic and Organometallic Compounds, Academic Press, New York, 1970, 1-636. [all data]
Lee, 1986
Lee, F.-M.,
Use of Organic Sulfones as the Extractive Distillation SOlvent for Aromatic Recovery,
Ind. Eng. Chem. Process Des. Dev., 1986, 25, 949-57. [all data]