2-Octanol, (R)-
- Formula: C8H18O
- Molecular weight: 130.2279
- IUPAC Standard InChIKey: SJWFXCIHNDVPSH-QMMMGPOBSA-N
- CAS Registry Number: 5978-70-1
- Chemical structure:
View 3d structure (requires JavaScript / HTML 5) - Stereoisomers:
- Other names: (R)-(-)-2-Octanol; l-octan-2-ol

Phase change data

Data compiled as indicated in comments:
BS - Robert L. Brown and Stephen E. Stein
TRC - Thermodynamics Research Center, NIST Boulder Laboratories, Chris Muzny director
Quantity | Value | Units | Method | Reference | Comment |
---|---|---|---|---|---|
Tboil | 448.2 | K | N/A | Aldrich Chemical Company Inc., 1990 | BS |
Tboil | 449.65 | K | N/A | Beringer and Schultz, 1955 | Uncertainty assigned by TRC = 2. K; TRC |
Reduced pressure boiling point
Tboil (K) | Pressure (bar) | Reference | Comment |
---|---|---|---|
359.2 | 0.027 | Weast and Grasselli, 1989 | BS |

References

Aldrich Chemical Company Inc., 1990
Aldrich Chemical Company Inc.,
Catalog Handbook of Fine Chemicals, Aldrich Chemical Company, Inc., Milwaukee WI, 1990, 1. [all data]
Beringer and Schultz, 1955
Beringer, F.M.; Schultz, H.S.,
J. Am. Chem. Soc., 1955, 77, 5533. [all data]
Weast and Grasselli, 1989
CRC Handbook of Data on Organic Compounds, 2nd Editon, Weast,R.C and Grasselli, J.G., ed(s)., CRC Press, Inc., Boca Raton, FL, 1989, 1. [all data]