Pb3

Gas phase ion energetics data

Data compiled by: John E. Bartmess

Electron affinity determinations

EA (eV) Method Reference Comment
1.63 ± 0.10LPESSun, Sun, et al., 2009
1.68 ± 0.10LPESSobhy, Reveles, et al., 2009Stated electron affinity is the Vertical Detachment Energy
1.700 ± 0.088LPESGanteför, Gausa, et al., 1989EA: sharp threshold, ≤EA(adiabatic).

References

Sun, Sun, et al., 2009
Sun, Z.; Sun, S.T.; Liu, H.T.; Zhu, Q.H.; Gao, Z.; Tang, Z.C., Photoelectron Spectroscopic and Theoretical Studies of MmC6F5 Anionic Complexes (M = Ph and Bi; m=1-4), J. Phys. Chem. A, 2009, 113, 28, 8045-8054, https://doi.org/10.1021/jp8099626 . [all data]

Sobhy, Reveles, et al., 2009
Sobhy, M.A.; Reveles, J.U.; Gupta, U.; Khanna, S.N.; Castleman, A.W., Photoelectron imaging and theoretical investigation of bimetallic Bi1-2Ga0-2- and Pb-1-4(-) cluster anions, J. Chem. Phys., 2009, 130, 5, 054304, https://doi.org/10.1063/1.3069295 . [all data]

Ganteför, Gausa, et al., 1989
Ganteför, G.; Gausa, M.; Meiwes-Broer, K.H.; Lutz, H.O., Photoemission from Tin and Lead Clusters Anions, Z. Phys. D, 1989, 14, 1-4, 405, https://doi.org/10.1007/BF01426983 . [all data]