3-Hexanol, 3-ethyl-
- Formula: C8H18O
- Molecular weight: 130.2279
- IUPAC Standard InChIKey: WNDLTOTUHMHNOC-UHFFFAOYSA-N
- CAS Registry Number: 597-76-2
- Chemical structure:
View 3d structure (requires JavaScript / HTML 5) - Other names: 1,1-Diethyl-1-butanol; 3-Ethyl-3-hexanol; 3-ethylhexan-3-ol

Phase change data

Data compiled as indicated in comments:
TRC - Thermodynamics Research Center, NIST Boulder Laboratories, Chris Muzny director
AC - William E. Acree, Jr., James S. Chickos
Quantity | Value | Units | Method | Reference | Comment |
---|---|---|---|---|---|
Tboil | 433.25 | K | N/A | Lanning and Moore, 1958 | Uncertainty assigned by TRC = 2. K; TRC |
Tboil | 433.15 | K | N/A | Baerts, 1922 | Uncertainty assigned by TRC = 3. K; TRC |
Tboil | 431.65 | K | N/A | Halse, 1914 | Uncertainty assigned by TRC = 3. K; TRC |
Tboil | 432.15 | K | N/A | Masson, 1901 | Uncertainty assigned by TRC = 3. K; TRC |
Enthalpy of vaporization
ΔvapH (kJ/mol) | Temperature (K) | Reference | Comment |
---|---|---|---|
49.2 | 345. | Wilhoit and Zwolinski, 1973 | Based on data from 331. to 433. K.; AC |

References

Lanning and Moore, 1958
Lanning; Moore,
J. Org. Chem., 1958, 23, 288. [all data]
Baerts, 1922
Baerts, F.,
Action of organomagnesium compounds on nitriles n-butyronitrile,
Bull. Soc. Chim. Belg., 1922, 31, 421. [all data]
Halse, 1914
Halse, M.O.,
J. Prakt. Chem., 1914, 89, 451. [all data]
Masson, 1901
Masson, H.,
Syntheses of tertiary alcohols of the fatty acids,
C. R. Hebd. Seances Acad. Sci., 1901, 132, 483-5. [all data]
Wilhoit and Zwolinski, 1973
Wilhoit, R.C.; Zwolinski, B.J.,
Physical and thermodynamic properties of aliphatic alcohols,
J. Phys. Chem. Ref. Data Suppl., 1973, 1, 2, 1. [all data]