acetoacetamide
- IUPAC Standard InChIKey: GCPWJFKTWGFEHH-UHFFFAOYSA-N
- CAS Registry Number: 5977-14-0
- Chemical structure:
View 3d structure (requires JavaScript / HTML 5) - Permanent link for this species. Use this link for bookmarking this species for future reference.

Reaction thermochemistry data

Data compiled by: Hussein Y. Afeefy, Joel F. Liebman, and Stephen E. Stein
Individual Reactions
By formula: C4H4O2 + H3N = acetoacetamide
Quantity | Value | Units | Method | Reference | Comment |
---|---|---|---|---|---|
ΔrH° | -173.0 | kJ/mol | Kin | Lopatin, Popov, et al., 1992 | liquid phase; solvent: Solution |

References

Lopatin, Popov, et al., 1992
Lopatin, E.B.; Popov, V.V.; Epshtein, N.A.; Mikhaleva, L.M.; Makarov, Yu.N.,
Kinetic and thermochemical characteristics of diketene-based reactions,
Khim.-Farm. Zh., 1992, 26, 76-78. [all data]