Triethylsilanol
- Formula: C6H16OSi
- Molecular weight: 132.2761
- IUPAC Standard InChIKey: WVMSIBFANXCZKT-UHFFFAOYSA-N
- CAS Registry Number: 597-52-4
- Chemical structure:
View 3d structure (requires JavaScript / HTML 5) - Other names: Silanol, triethyl-; (C2H5)3SiOH

Phase change data

Data compiled as indicated in comments:
BS - Robert L. Brown and Stephen E. Stein
AC - William E. Acree, Jr., James S. Chickos
Reduced pressure boiling point
Tboil (K) | Pressure (bar) | Reference | Comment |
---|---|---|---|
348. | 0.032 | PCR Inc., 1990 | BS |
Enthalpy of vaporization
ΔvapH (kJ/mol) | Temperature (K) | Method | Reference | Comment |
---|---|---|---|---|
50.6 | 355. | I | Grubb and Osthoff, 1953 | Based on data from 298. to 413. K.; AC |
Antoine Equation Parameters
log10(P) = A − (B / (T + C))
P = vapor pressure (bar)
T = temperature (K)
View plot Requires a JavaScript / HTML 5 canvas capable browser.
Temperature (K) | A | B | C | Reference | Comment |
---|---|---|---|---|---|
297.7 to 413.4 | 6.54654 | 2901.509 | 16.518 | Grubb and Osthoff, 1953 | Coefficents calculated by NIST from author's data. |

Reaction thermochemistry data

Data compiled by: John E. Bartmess
Individual Reactions
C6H15OSi- + =
By formula: C6H15OSi- + H+ = C6H16OSi
Quantity | Value | Units | Method | Reference | Comment |
---|---|---|---|---|---|
ΔrH° | 1497. ± 9.2 | kJ/mol | G+TS | Grimm and Bartmess, 1992 | gas phase |
ΔrH° | 1504. ± 17. | kJ/mol | G+TS | Damrauer, Simon, et al., 1991 | gas phase; between pyrrole, CF3CH2OH |
Quantity | Value | Units | Method | Reference | Comment |
ΔrG° | 1471. ± 8.4 | kJ/mol | IMRE | Grimm and Bartmess, 1992 | gas phase |
ΔrG° | 1477. ± 17. | kJ/mol | IMRB | Damrauer, Simon, et al., 1991 | gas phase; between pyrrole, CF3CH2OH |

Gas phase ion energetics data

Data evaluated as indicated in comments:
HL - Edward P. Hunter and Sharon G. Lias
Data compiled as indicated in comments:
B - John E. Bartmess
Quantity | Value | Units | Method | Reference | Comment |
---|---|---|---|---|---|
Proton affinity (review) | 822.1 | kJ/mol | N/A | Hunter and Lias, 1998 | HL |
Quantity | Value | Units | Method | Reference | Comment |
Gas basicity | 794.8 | kJ/mol | N/A | Hunter and Lias, 1998 | HL |
De-protonation reactions
C6H15OSi- + =
By formula: C6H15OSi- + H+ = C6H16OSi
Quantity | Value | Units | Method | Reference | Comment |
---|---|---|---|---|---|
ΔrH° | 1497. ± 9.2 | kJ/mol | G+TS | Grimm and Bartmess, 1992 | gas phase; B |
ΔrH° | 1504. ± 17. | kJ/mol | G+TS | Damrauer, Simon, et al., 1991 | gas phase; between pyrrole, CF3CH2OH; B |
Quantity | Value | Units | Method | Reference | Comment |
ΔrG° | 1471. ± 8.4 | kJ/mol | IMRE | Grimm and Bartmess, 1992 | gas phase; B |
ΔrG° | 1477. ± 17. | kJ/mol | IMRB | Damrauer, Simon, et al., 1991 | gas phase; between pyrrole, CF3CH2OH; B |

References

PCR Inc., 1990
PCR Inc.,
Research Chemicals Catalog 1990-1991, PCR Inc., Gainesville, FL, 1990, 1. [all data]
Grubb and Osthoff, 1953
Grubb, Willard T.; Osthoff, Robert C.,
Physical Properties of Organosilicon Compounds. II. Trimethylsilanol and Triethylsilanol,
J. Am. Chem. Soc., 1953, 75, 9, 2230-2232, https://doi.org/10.1021/ja01105a061
. [all data]
Grimm and Bartmess, 1992
Grimm, D.T.; Bartmess, J.E.,
The Intrinsic (Gas Phase) Basicity of some Anions Commonly Used in Condensed-Phase Synthesis,
J. Am. Chem. Soc., 1992, 114, 4, 1227, https://doi.org/10.1021/ja00030a016
. [all data]
Damrauer, Simon, et al., 1991
Damrauer, R.; Simon, R.; Krempp, M.,
Effect of Substituents on the Gas-Phase Acidity of Silanols,
J. Am. Chem. Soc., 1991, 113, 12, 4431, https://doi.org/10.1021/ja00012a009
. [all data]
Hunter and Lias, 1998
Hunter, E.P.; Lias, S.G.,
Evaluated Gas Phase Basicities and Proton Affinities of Molecules: An Update,
J. Phys. Chem. Ref. Data, 1998, 27, 3, 413-656, https://doi.org/10.1063/1.556018
. [all data]