2-ethyl-2-methyl-1-pentanol
- Formula: C8H18O
- Molecular weight: 130.2279
- IUPAC Standard InChIKey: VZCOFGHOKLEMPL-UHFFFAOYSA-N
- CAS Registry Number: 5970-63-8
- Chemical structure:
View 3d structure (requires JavaScript / HTML 5) - Permanent link for this species. Use this link for bookmarking this species for future reference.

Phase change data

Data compiled by: Thermodynamics Research Center, NIST Boulder Laboratories, Chris Muzny director
Quantity | Value | Units | Method | Reference | Comment |
---|---|---|---|---|---|
Tboil | 447.65 | K | N/A | Brannock, 1959 | Uncertainty assigned by TRC = 3. K |

References

Brannock, 1959
Brannock, K.C.,
Preparation of substituted 4-pentenals,
J. Am. Chem. Soc., 1959, 81, 3379. [all data]