Iron(2) oxide anion

Ion clustering data

Data compiled by: John E. Bartmess

Clustering reactions

(FeO- • 4294967295iron) + iron = FeO-

By formula: (FeO- • 4294967295Fe) + Fe = FeO-

Quantity Value Units Method Reference Comment
Δr395. ± 17.kJ/molN/ADrechsler, Boesl, et al., 1997gas phase
Δr395. ± 29.kJ/molTherEngelking and Lineberger, 1977gas phase

Reaction thermochemistry data

Data compiled by: John E. Bartmess

Individual Reactions

(FeO- • 4294967295iron) + iron = FeO-

By formula: (FeO- • 4294967295Fe) + Fe = FeO-

Quantity Value Units Method Reference Comment
Δr94.3 ± 4.0kcal/molN/ADrechsler, Boesl, et al., 1997gas phase
Δr94.3 ± 7.0kcal/molTherEngelking and Lineberger, 1977gas phase

References

Drechsler, Boesl, et al., 1997
Drechsler, G.; Boesl, U.; Bassmann, C.; Schlag, E.W., Mass selected anion-zero kinetic energy photoelectron spectroscopy (anion-ZEKE): Ground and low excited states of FeO, J. Chem. Phys., 1997, 107, 7, 2284-2291, https://doi.org/10.1063/1.474622 . [all data]

Engelking and Lineberger, 1977
Engelking, P.C.; Lineberger, W.C., Laser photoelecton spectrometry of FeO-: Electron affinity, electronic state separations, and ground state vibrations of iron oxide, and a new ground state assignment, J. Chem. Phys., 1977, 66, 5054. [all data]