2-Propanol, 1,3-bis(dimethylamino)-
- Formula: C7H18N2O
- Molecular weight: 146.2306
- IUPAC Standard InChIKey: JGVZJRHAZOBPMW-UHFFFAOYSA-N
- CAS Registry Number: 5966-51-8
- Chemical structure:
View 3d structure (requires JavaScript / HTML 5) - Other names: 1,3-Bis(dimethylamino)-2-hydroxypropane; 1,3-Bis(dimethylamino)-2-propanol; 1,3-Bis(dimethylamino)isopropanol; 1,3-bis(dimethylamino)propan-2-ol

Phase change data

Data compiled as indicated in comments:
BS - Robert L. Brown and Stephen E. Stein
AC - William E. Acree, Jr., James S. Chickos
Reduced pressure boiling point
Tboil (K) | Pressure (bar) | Reference | Comment |
---|---|---|---|
353. to 355. | 0.023 | Buckingham and Donaghy, 1982 | BS |
Enthalpy of vaporization
ΔvapH (kJ/mol) | Temperature (K) | Method | Reference | Comment |
---|---|---|---|---|
50.3 | 370. | A | Stephenson and Malanowski, 1987 | Based on data from 355. to 450. K.; AC |

References

Buckingham and Donaghy, 1982
Buckingham, J.; Donaghy, S.M.,
Dictionary of Organic Compounds: Fifth Edition, Chapman and Hall, New York, 1982, 1. [all data]
Stephenson and Malanowski, 1987
Stephenson, Richard M.; Malanowski, Stanislaw,
Handbook of the Thermodynamics of Organic Compounds, 1987, https://doi.org/10.1007/978-94-009-3173-2
. [all data]