β-D-Glucopyranose, 4-O-β-D-galactopyranosyl-
- Formula: C12H22O11
- Molecular weight: 342.2965
- IUPAC Standard InChIKey: GUBGYTABKSRVRQ-OXMKDSILSA-N
- CAS Registry Number: 5965-66-2
- Chemical structure:
View 3d structure (requires JavaScript / HTML 5) - Stereoisomers:
- Other names: Lactose, β-; β-Lactose; 4-O-β-D-Galactopyranosyl-β-D-glucopyranose; beta-Lactose; β-D-Lactose; Lactopress

Condensed phase thermochemistry data

Data compiled as indicated in comments:
ALS - Hussein Y. Afeefy, Joel F. Liebman, and Stephen E. Stein
DH - Eugene S. Domalski and Elizabeth D. Hearing
Quantity | Value | Units | Method | Reference | Comment |
---|---|---|---|---|---|
ΔfH°solid | -2236.7 ± 0.71 | kJ/mol | Ccb | Clarke and Stegeman, 1939 | Reanalyzed by Cox and Pilcher, 1970, Original value = -2235.8 kJ/mol; ALS |
Quantity | Value | Units | Method | Reference | Comment |
ΔcH°solid | -5629.45 ± 0.50 | kJ/mol | Ccb | Clarke and Stegeman, 1939 | Corresponding ΔfHºsolid = -2236.8 kJ/mol (simple calculation by NIST; no Washburn corrections); ALS |
Quantity | Value | Units | Method | Reference | Comment |
S°solid,1 bar | 386.2 | J/mol*K | N/A | Anderson and Stegeman, 1941 | Extrapolation below 90 K, 94.6 J/mol*K.; DH |
S°solid,1 bar | 403.3 | J/mol*K | N/A | Furtsch and Stegeman, 1936 | Extrapolation below 90 K, 26.00 cal/mol*K.; DH |
Constant pressure heat capacity of solid
Cp,solid (J/mol*K) | Temperature (K) | Reference | Comment |
---|---|---|---|
399.78 | 289.44 | Anderson and Stegeman, 1941 | T = 65 to 290 K. Value is unsmoothed experimental datum.; DH |
408.27 | 298.44 | Furtsch and Stegeman, 1936 | T = 83 to 298 K. Value is unsmoothed experimental datum.; DH |

Reaction thermochemistry data

Data compiled by: Hussein Y. Afeefy, Joel F. Liebman, and Stephen E. Stein
Individual Reactions
By formula: C12H22O11 + H2O = C6H12O6 + C6H12O6
Quantity | Value | Units | Method | Reference | Comment |
---|---|---|---|---|---|
ΔrH° | 0.44 ± 0.11 | kJ/mol | Eqk | Goldberg and Tewari, 1989 | liquid phase; solvent: Aqueous; HPLC |

References

Clarke and Stegeman, 1939
Clarke, T.H.; Stegeman, G.,
Heats of combustion of some mono- and disaccharides,
J. Am. Chem. Soc., 1939, 61, 1726-1730. [all data]
Cox and Pilcher, 1970
Cox, J.D.; Pilcher, G.,
Thermochemistry of Organic and Organometallic Compounds, Academic Press, New York, 1970, 1-636. [all data]
Anderson and Stegeman, 1941
Anderson, A.G.; Stegeman, G.,
The heat capacities and entropies of three disacchardes,
J. Am. Chem. Soc., 1941, 63, 2119-2121. [all data]
Furtsch and Stegeman, 1936
Furtsch, E.F.; Stegeman, G.,
The heat capacity and entropy of b-lactose,
J. Am. Chem. Soc., 1936, 58, 881-882. [all data]
Goldberg and Tewari, 1989
Goldberg, R.N.; Tewari, Y.B.,
A calorimetric and equilibrium investigatino of the hydrolysis of lactose,
J. Biol. Chem., 1989, 264, 9897-9900. [all data]