Bis(triphenylmethyl)peroxide
- Formula: C38H30O2
- Molecular weight: 518.6436
- IUPAC Standard InChIKey: CGQJDFJVDYLLLN-UHFFFAOYSA-N
- CAS Registry Number: 596-30-5
- Chemical structure:
View 3d structure (requires JavaScript / HTML 5) - Permanent link for this species. Use this link for bookmarking this species for future reference.

Condensed phase thermochemistry data

Data compiled by: Hussein Y. Afeefy, Joel F. Liebman, and Stephen E. Stein
Quantity | Value | Units | Method | Reference | Comment |
---|---|---|---|---|---|
ΔfH°solid | 156. | kJ/mol | Ccb | Schmidlin, 1906 | Author hf298_condensed=18 kcal/mol |
ΔfH°solid | 75. | kJ/mol | Ccb | Schmidin, 1904 | |
Quantity | Value | Units | Method | Reference | Comment |
ΔcH°solid | -19400. | kJ/mol | Ccb | Schmidlin, 1906 | Author hf298_condensed=18 kcal/mol; Corresponding ΔfHºsolid = 150. kJ/mol (simple calculation by NIST; no Washburn corrections) |
ΔcH°solid | -19400. | kJ/mol | Ccb | Schmidin, 1904 | Corresponding ΔfHºsolid = 150. kJ/mol (simple calculation by NIST; no Washburn corrections) |

Phase change data

Data compiled by: William E. Acree, Jr., James S. Chickos
Enthalpy of sublimation
ΔsubH (kJ/mol) | Temperature (K) | Method | Reference | Comment |
---|---|---|---|---|
158.1 | 407. | A | Stephenson and Malanowski, 1987 | Based on data from 392. to 434. K. |

Reaction thermochemistry data

Data compiled by: Hussein Y. Afeefy, Joel F. Liebman, and Stephen E. Stein
Individual Reactions
By formula: C38H30 + O2 = C38H30O2
Quantity | Value | Units | Method | Reference | Comment |
---|---|---|---|---|---|
ΔrH° | -190.4 ± 2.1 | kJ/mol | Cm | Bent, Cuthbertson, et al., 1936 | solid phase; Heat of oxidation |

References

Schmidlin, 1906
Schmidlin, M.J.,
Recherches chimiques et thermochimiques sur la constitution des rosanilines,
Ann. Chim. Phys., 1906, 1, 195-256. [all data]
Schmidin, 1904
Schmidin, M.J.,
Chaleurs de combustion du triphenylmethyle et de quelques derives du triphenylmethane,
Compt. Rend., 1904, 139, 732-733. [all data]
Stephenson and Malanowski, 1987
Stephenson, Richard M.; Malanowski, Stanislaw,
Handbook of the Thermodynamics of Organic Compounds, 1987, https://doi.org/10.1007/978-94-009-3173-2
. [all data]
Bent, Cuthbertson, et al., 1936
Bent, H.E.; Cuthbertson, G.R.; Dorfman, M.; Leary, R.E.,
Single bond energies. I. The C-C bond in hexaphenylethane,
J. Am. Chem. Soc., 1936, 58, 165-170. [all data]