Pentafluorophenoxyphosphoryl difluoride

Phase change data

Data compiled by: William E. Acree, Jr., James S. Chickos

Enthalpy of vaporization

ΔvapH (kJ/mol) Temperature (K) Reference Comment
46.4338.Falardeau and Desmarteau, 1976Based on data from 323. - 367. K.

References

Falardeau and Desmarteau, 1976
Falardeau, E.R.; Desmarteau, D.D., Synthesis of pentafluorophenoxy derivatives of phosphorus in various oxidation states, Journal of Fluorine Chemistry, 1976, 7, 1-3, 185-195, https://doi.org/10.1016/S0022-1139(00)83995-0 . [all data]