Benzenamine, 4-methoxy-N-methyl-
- Formula: C8H11NO
- Molecular weight: 137.1790
- IUPAC Standard InChIKey: JFXDIXYFXDOZIT-UHFFFAOYSA-N
- CAS Registry Number: 5961-59-1
- Chemical structure:
View 3d structure (requires JavaScript / HTML 5) - Other names: p-Anisidine, N-methyl-; p-Methoxy-N-methylaniline; N-Methyl-p-anisidine; N-Methyl-4-methoxyaniline; 4-Methoxy-N-methylaniline; 4-Methoxy-N-methylbenzenamine; N-Methyl-p-ansidine; 1-Methylamino-4-methoxybenzene; N-methyl-4-anisidine

Phase change data

Data compiled by: Robert L. Brown and Stephen E. Stein
Reduced pressure boiling point
Tboil (K) | Pressure (bar) | Reference |
---|---|---|
408.7 | 0.025 | Aldrich Chemical Company Inc., 1990 |

Reaction thermochemistry data

Data compiled by: Hussein Y. Afeefy, Joel F. Liebman, and Stephen E. Stein
Individual Reactions
By formula: C8H11NO = 0.5C7H9NO + 0.5C9H13NO
Quantity | Value | Units | Method | Reference | Comment |
---|---|---|---|---|---|
ΔrH° | 0.4 | kJ/mol | Eqk | Matvienko, Kachurin, et al., 1982 | liquid phase; Methanesulfonic acid |

References

Aldrich Chemical Company Inc., 1990
Aldrich Chemical Company Inc.,
Catalog Handbook of Fine Chemicals, Aldrich Chemical Company, Inc., Milwaukee WI, 1990, 1. [all data]
Matvienko, Kachurin, et al., 1982
Matvienko, N.M.; Kachurin, O.I.; Chekhuta, V.G.,
Kinetics and equilibrium of the transalkylation reaction of N-methylarylamines,
Russ. Chem. Rev., 1982, 48, 42-45. [all data]