Thiirane, 2,3-dimethyl-, trans-
- Formula: C4H8S
- Molecular weight: 88.171
- IUPAC Standard InChIKey: ZMJBHCIEMIVIFZ-IMJSIDKUSA-N
- CAS Registry Number: 5955-98-6
- Chemical structure:
View 3d structure (requires JavaScript / HTML 5) - Stereoisomers:
- Other names: trans-2-Butene Episulfide; Butane, 2,3-epithio-, trans-; trans-2-Butene Sulfide; trans-2,3-Dimethylthiirane; (E)-2,3-Dimethylthiirane; 2,3-Dimethyl-thiirane (E); trans-Dimethylthiirane

Condensed phase thermochemistry data

Data compiled by: Hussein Y. Afeefy, Joel F. Liebman, and Stephen E. Stein
Quantity | Value | Units | Method | Reference | Comment |
---|---|---|---|---|---|
ΔfH°liquid | -30. ± 1. | kJ/mol | Ccr | Sunner, 1963 | |
Quantity | Value | Units | Method | Reference | Comment |
ΔcH°liquid | -3290. ± 1. | kJ/mol | Ccr | Sunner, 1963 |

Normal alkane RI, non-polar column, temperature ramp

Column type | Active phase | I | Reference | Comment |
---|---|---|---|---|
Capillary | DB-5 | 746. | Macku and Shibamoto, 1991 | He, 40. C @ 5. min, 2. K/min; Column length: 60. m; Column diameter: 0.25 mm; Tend: 160. C |

Normal alkane RI, non-polar column, custom temperature program

Column type | Active phase | I | Reference | Comment |
---|---|---|---|---|
Capillary | Methyl Silicone | 688. | Farkas, Héberger, et al., 2004 | Program: not specified |

References

Sunner, 1963
Sunner, S.,
Corrected heat of combustion and formation values for a number of organic sulphur compounds,
Acta Chem. Scand., 1963, 17, 728-730. [all data]
Macku and Shibamoto, 1991
Macku, C.; Shibamoto, T.,
Volatile sulfur-containing compounds generated from the thermal interaction of corn oil and cysteine,
J. Agric. Food Chem., 1991, 39, 11, 1987-1989, https://doi.org/10.1021/jf00011a021
. [all data]
Farkas, Héberger, et al., 2004
Farkas, O.; Héberger, K.; Zenkevich, I.G.,
Quantitative structure-retention relationships. XIV. Prediction of gas chromatographic retention indices for saturated O-, N-, and S-heterocyclic compounds,
Chemom. Intell. Lab. Syst., 2004, 72, 2, 173-184, https://doi.org/10.1016/j.chemolab.2004.01.012
. [all data]