Dimethyl propanedioic acid
- Formula: C5H8O4
- Molecular weight: 132.1146
- IUPAC Standard InChIKey: OREAFAJWWJHCOT-UHFFFAOYSA-N
- CAS Registry Number: 595-46-0
- Chemical structure:
View 3d structure (requires JavaScript / HTML 5) - Other names: propanedioic acid dimethyl; dimethylmalonic acid

Condensed phase thermochemistry data

Data compiled by: Hussein Y. Afeefy, Joel F. Liebman, and Stephen E. Stein
Quantity | Value | Units | Method | Reference | Comment |
---|---|---|---|---|---|
ΔfH°liquid | -797.1 | kJ/mol | Ccb | Guinchant, 1918 | Author hf288_condensed[kcal/mol]=-195.0 kcal/mol |
Quantity | Value | Units | Method | Reference | Comment |
ΔcH°liquid | -2314. | kJ/mol | Ccb | Guinchant, 1918 | Author hf288_condensed[kcal/mol]=-195.0 kcal/mol; Corresponding ΔfHºliquid = -797.1 kJ/mol (simple calculation by NIST; no Washburn corrections) |

Phase change data

Data compiled by: Donald R. Burgess, Jr.
Quantity | Value | Units | Method | Reference | Comment |
---|---|---|---|---|---|
ΔvapH° | 61.9 | kJ/mol | N/A | Verevkin, Beckhaus, et al., 1992 |

Gas phase thermochemistry data

Data compiled by: Donald R. Burgess, Jr.
Quantity | Value | Units | Method | Reference | Comment |
---|---|---|---|---|---|
ΔfH°gas | -175.7 | kcal/mol | N/A | Guinchant, 1918 | Value computed using ΔfHliquid° value of -797.1 kj/mol from Guinchant, 1918 and ΔvapH° value of 61.9 kj/mol from Verevkin, Beckhaus, et al., 1992. |

References

Guinchant, 1918
Guinchant, M.J.,
Etude sur la fonction acide dans les derives metheniques et methiniques,
Ann. Chem., 1918, 10, 30-84. [all data]
Verevkin, Beckhaus, et al., 1992
Verevkin, S.P.; Beckhaus, H.-D.; Ruchardt, C.,
Geminale substituenteneffekte Teil 5α. Standardbildungsenthalpien von alkylsubstituierten Malonsaure- und α-aminocarbonsaureestern,
Thermochim. Acta, 1992, 197, 27-39. [all data]