3-Pentanol, 2,3-dimethyl-
- Formula: C7H16O
- Molecular weight: 116.2013
- IUPAC Standard InChIKey: RFZHJHSNHYIRNE-UHFFFAOYSA-N
- CAS Registry Number: 595-41-5
- Chemical structure:
View 3d structure (requires JavaScript / HTML 5) - Other names: 2,3-Dimethyl-3-pentanol; 3,4-Dimethyl-3-pentanol; 2,3-dimethylpentan-3-ol

Phase change data

Data compiled as indicated in comments:
BS - Robert L. Brown and Stephen E. Stein
TRC - Thermodynamics Research Center, NIST Boulder Laboratories, Chris Muzny director
AC - William E. Acree, Jr., James S. Chickos
Quantity | Value | Units | Method | Reference | Comment |
---|---|---|---|---|---|
Tboil | 412.9 | K | N/A | Weast and Grasselli, 1989 | BS |
Tboil | 410.65 | K | N/A | Schmerling and Meisinger, 1953 | Uncertainty assigned by TRC = 3. K; TRC |
Tboil | 412.85 | K | N/A | Pichler, Ziesecke, et al., 1950 | Uncertainty assigned by TRC = 1. K; TRC |
Tboil | 409. | K | N/A | Pariselle and Simon, 1921 | Uncertainty assigned by TRC = 3. K; TRC |
Enthalpy of vaporization
ΔvapH (kJ/mol) | Temperature (K) | Reference | Comment |
---|---|---|---|
53.2 | 333. | Wilhoit and Zwolinski, 1973 | Based on data from 318. to 413. K.; AC |

Normal alkane RI, non-polar column, custom temperature program

Column type | Active phase | I | Reference | Comment |
---|---|---|---|---|
Capillary | Methyl Silicone | 824. | Feng and Mu, 2007 | Program: not specified |
Capillary | Methyl Silicone | 824. | Estrada and Gutierrez, 1999 | Program: not specified |

Normal alkane RI, polar column, isothermal

Column type | Active phase | Temperature (C) | I | Reference | Comment |
---|---|---|---|---|---|
Packed | PEG | 100. | 1223. | Dowling, Evans, et al., 1990 | Phasesep W (10 %) |
Packed | PEG | 100. | 1249. | Dowling, Evans, et al., 1990 | Phasesep W (10 %) |

Normal alkane RI, polar column, temperature ramp

Column type | Active phase | I | Reference | Comment |
---|---|---|---|---|
Capillary | DB-Wax | 1218. | Souza, Re-Poppi, et al., 2012 | 30. m/0.25 mm/0.25 μm, Helium, 60. C @ 1. min, 5. K/min; Tend: 240. C |

References

Weast and Grasselli, 1989
CRC Handbook of Data on Organic Compounds, 2nd Editon, Weast,R.C and Grasselli, J.G., ed(s)., CRC Press, Inc., Boca Raton, FL, 1989, 1. [all data]
Schmerling and Meisinger, 1953
Schmerling, L.; Meisinger, E.E.,
Condensation of Saturated Halides with Unsaturated Compounds X. Condensation of t-Butyl Halides with Propene, 1-Butene and 2-Butene,
J. Am. Chem. Soc., 1953, 75, 6217. [all data]
Pichler, Ziesecke, et al., 1950
Pichler, H.; Ziesecke, K.H.; Traeger, B.,
The Oxygen-containing Compounds, Especially Alcohols, Formed in Isosynthesis,
Brennst.-Chem., 1950, 31, 361. [all data]
Pariselle and Simon, 1921
Pariselle, M.; Simon, L.J.,
C. R. Hebd. Seances Acad. Sci., 1921, 173, 86. [all data]
Wilhoit and Zwolinski, 1973
Wilhoit, R.C.; Zwolinski, B.J.,
Physical and thermodynamic properties of aliphatic alcohols,
J. Phys. Chem. Ref. Data Suppl., 1973, 1, 2, 1. [all data]
Feng and Mu, 2007
Feng, H.; Mu, L.-L.,
Quantitative structure-retention relationships for alkane and its derivatives based on electrotopological state index and molecular shape index,
Chem. Ind. Engineering (Chinese), 2007, 24, 2, 161-168. [all data]
Estrada and Gutierrez, 1999
Estrada, E.; Gutierrez, Y.,
Modeling chromatographic parameters by a novel graph theoretical sub-structural approach,
J. Chromatogr. A, 1999, 858, 2, 187-199, https://doi.org/10.1016/S0021-9673(99)00808-0
. [all data]
Dowling, Evans, et al., 1990
Dowling, J.J.; Evans, M.B.; Haken, J.K.,
Gas-liquid chromatography in qualitative analysis. XVIII. Study of the dependence of the retention behavior of polyoxyethylene glycol columns on the nature of the support and phase loading,
J. Chromatogr., 1990, 500, 355-365, https://doi.org/10.1016/S0021-9673(00)96077-1
. [all data]
Souza, Re-Poppi, et al., 2012
Souza, J.B.G.; Re-Poppi, N.; Raposo, J.L.(Jr).,
Characterization of pyroligneous acid used in agriculture by gas chromatography - mass spectrometry (in press),
J. Braz. Chem. Soc., 2012, 00, 00, 1-8. [all data]