(1R)-1,8,8-trimethyl-3-oxabicyclo[3.2.1]octane-2,4-dione
- Formula: C10H14O3
- Molecular weight: 182.2164
- IUPAC Standard InChIKey: VFZDNKRDYPTSTP-UHFFFAOYSA-N
- CAS Registry Number: 595-29-9
- Chemical structure:
View 3d structure (requires JavaScript / HTML 5) - Species with the same structure:
- Other names: D-camphoric anhydride

Phase change data

Data compiled by: Thermodynamics Research Center, NIST Boulder Laboratories, Chris Muzny director
Quantity | Value | Units | Method | Reference | Comment |
---|---|---|---|---|---|
Tfus | 495. | K | N/A | Mjojo, 1979 | Crystal phase 1 phase; Uncertainty assigned by TRC = 1. K |

References

Mjojo, 1979
Mjojo, C.C.,
Order-disorder phenomena: part 2. order-disorder phase equilibria in d-and l-systems of camphor and related compounds.,
J. Chem. Soc., Faraday Trans. 2, 1979, 75, 692-703. [all data]