DL-Methionine
- Formula: C5H11NO2S
- Molecular weight: 149.211
- IUPAC Standard InChIKey: FFEARJCKVFRZRR-UHFFFAOYSA-N
- CAS Registry Number: 59-51-8
- Chemical structure:
- Stereoisomers:
- Other names: Racemethionine; DL-2-Amino-4-(methylthio)butanoic acid; DL-CH3SCH2CH2CH(NH2)COOH; α-Amino-γ-methylmercaptobutyric acid; (.+/-.)-Methionine; Acimetion; Banthionine; Cynaron; Dyprin; DL-2-Amino-4-(methylthio)butyric acid; Lobamine; Meonine; Mertionin; Methilanin; Methionine; Methionine, DL-; Metione; Neston; Urimeth; Pedameth; 2-Amino-4-(methylmercapto)butyric acid; Amurex; Methilonin; Methionine dl-form; Metion; Petameth; NSC 9241

Condensed phase thermochemistry data

Data compiled by: Eugene S. Domalski and Elizabeth D. Hearing
Quantity | Value | Units | Method | Reference | Comment |
---|---|---|---|---|---|
S°solid,1 bar | 231.46 | J/mol*K | N/A | Hutchens, Cole, et al., 1964 |
Constant pressure heat capacity of solid
Cp,solid (J/mol*K) | Temperature (K) | Reference | Comment |
---|---|---|---|
290.03 | 298.15 | Hutchens, Cole, et al., 1964 | T = 11 to 348 K. |

Phase change data

Data compiled by: Eugene S. Domalski and Elizabeth D. Hearing
Enthalpy of phase transition
ΔHtrs (kJ/mol) | Temperature (K) | Initial Phase | Final Phase | Reference | Comment |
---|---|---|---|---|---|
5.440 | 305.5 | crystaline, II | crystaline, I | Hutchens, Cole, et al., 1964 | Lambda transition over the temperature range 250 to 350 K with a maximum at 305.5 K. |
Entropy of phase transition
ΔStrs (J/mol*K) | Temperature (K) | Initial Phase | Final Phase | Reference | Comment |
---|---|---|---|---|---|
17.6 | 305.5 | crystaline, II | crystaline, I | Hutchens, Cole, et al., 1964 | Lambda |

Gas phase ion energetics data

Data compiled by: John E. Bartmess
De-protonation reactions
By formula: C5H10NO2S- + H+ = C5H11NO2S
Quantity | Value | Units | Method | Reference | Comment |
---|---|---|---|---|---|
ΔrH° | 1407. ± 9.2 | kJ/mol | CIDC | Jones, Bernier, et al., 2007 | gas phase |
ΔrH° | 1405. ± 13. | kJ/mol | G+TS | O'Hair, Bowie, et al., 1992 | gas phase |
Quantity | Value | Units | Method | Reference | Comment |
ΔrG° | 1376. ± 13. | kJ/mol | CIDC | O'Hair, Bowie, et al., 1992 | gas phase |

Reaction thermochemistry data

Data compiled by: John E. Bartmess
Individual Reactions
By formula: C5H10NO2S- + H+ = C5H11NO2S
Quantity | Value | Units | Method | Reference | Comment |
---|---|---|---|---|---|
ΔrH° | 336.3 ± 2.2 | kcal/mol | CIDC | Jones, Bernier, et al., 2007 | gas phase |
ΔrH° | 335.7 ± 3.1 | kcal/mol | G+TS | O'Hair, Bowie, et al., 1992 | gas phase |
Quantity | Value | Units | Method | Reference | Comment |
ΔrG° | 328.9 ± 3.0 | kcal/mol | CIDC | O'Hair, Bowie, et al., 1992 | gas phase |

References

Hutchens, Cole, et al., 1964
Hutchens, J.O.; Cole, A.G.; Stout, J.W.,
Heat capacities and entropies of L-cystine and L-methionine. The transition of L-methionine near 305.5 K,
J. Biol. Chem., 1964, 239, 591-595. [all data]
Jones, Bernier, et al., 2007
Jones, C.M.; Bernier, M.; Carson, E.; Colyer, K.E.; Metz, R.; Pawlow, A.; Wischow, E.D.; Webb, I.; Andriole, E.J.; Poutsma, J.C.,
Gas-phase Acities of the 20 Protein Amino Acids,
Int. J. Mass Spectrom., 2007, 267, 1-3, 54-62, https://doi.org/10.1016/j.ijms.2007.02.018
. [all data]
O'Hair, Bowie, et al., 1992
O'Hair, R.J.; Bowie, J.H.; Gronert, S.,
Gas Phase Acidity of the alpha-Amino Acids,
Int. J. Mass Spectrom. Ion Proc., 1992, 117, 23, https://doi.org/10.1016/0168-1176(92)80083-D
. [all data]