2,3-dichloro-2,3-dimethylbutane
- Formula: C6H12Cl2
- Molecular weight: 155.065
- IUPAC Standard InChIKey: SJBPUCQFQDUICP-UHFFFAOYSA-N
- CAS Registry Number: 594-85-4
- Chemical structure:
View 3d structure (requires JavaScript / HTML 5) - Permanent link for this species. Use this link for bookmarking this species for future reference.

Phase change data

Data compiled by: Thermodynamics Research Center, NIST Boulder Laboratories, Chris Muzny director
Quantity | Value | Units | Method | Reference | Comment |
---|---|---|---|---|---|
Tfus | 433. | K | N/A | White and Bishop, 1940 | Crystal phase 1 phase; Uncertainty assigned by TRC = 3. K |

References

White and Bishop, 1940
White, A.H.; Bishop, W.S.,
Dielectric Evidence of Molecular Rotation in the Crystals of Certain Non-aromatic Compounds,
J. Am. Chem. Soc., 1940, 62, 8-16. [all data]