Propane, 2-methyl-2-nitro-
- Formula: C4H9NO2
- Molecular weight: 103.1198
- IUPAC Standard InChIKey: AIMREYQYBFBEGQ-UHFFFAOYSA-N
- CAS Registry Number: 594-70-7
- Chemical structure:
View 3d structure (requires JavaScript / HTML 5) - Other names: Trimethylnitromethane; 1,1-Dimethyl-1-nitroethane; 2-Methyl-2-nitropropane; 2-Nitro-2-methylpropane; 2-Nitroisobutane; (CH3)3CNO2; tert-Nitrobutane; nitro-tert-butane

Gas phase thermochemistry data

Data compiled by: Hussein Y. Afeefy, Joel F. Liebman, and Stephen E. Stein
Quantity | Value | Units | Method | Reference | Comment |
---|---|---|---|---|---|
ΔfH°gas | -177.1 ± 3.3 | kJ/mol | Ccb | Knobel, Miroshnichenko, et al., 1970 | Reanalyzed by Pedley, Naylor, et al., 1986, Original value = -177. kJ/mol; Heat of Vaporization=9.6±0.1 kcal/mol |

Condensed phase thermochemistry data

Data compiled by: Hussein Y. Afeefy, Joel F. Liebman, and Stephen E. Stein
Quantity | Value | Units | Method | Reference | Comment |
---|---|---|---|---|---|
ΔfH°solid | -230. ± 3. | kJ/mol | Ccb | Knobel, Miroshnichenko, et al., 1970 | Heat of Vaporization=9.6±0.1 kcal/mol |
Quantity | Value | Units | Method | Reference | Comment |
ΔcH°solid | -2630. ± 3. | kJ/mol | Ccb | Knobel, Miroshnichenko, et al., 1970 | Heat of Vaporization=9.6±0.1 kcal/mol |

Phase change data

Data compiled as indicated in comments:
BS - Robert L. Brown and Stephen E. Stein
TRC - Thermodynamics Research Center, NIST Boulder Laboratories, Chris Muzny director
AC - William E. Acree, Jr., James S. Chickos
Quantity | Value | Units | Method | Reference | Comment |
---|---|---|---|---|---|
Tboil | 400.4 | K | N/A | Weast and Grasselli, 1989 | BS |
Tboil | 400. to 401. | K | N/A | Frinton Laboratories Inc., 1986 | BS |
Tboil | 400.65 | K | N/A | Kornblum, Clutter, et al., 1956 | Uncertainty assigned by TRC = 0.15 K; TRC |
Tboil | 400.31 | K | N/A | Toops, 1956 | Uncertainty assigned by TRC = 0.06 K; TRC |
Tboil | 399. | K | N/A | Kornblum, Smiley, et al., 1955 | Uncertainty assigned by TRC = 3. K; TRC |
Quantity | Value | Units | Method | Reference | Comment |
Tfus | 298.65 | K | N/A | Kornblum, Clutter, et al., 1956 | Uncertainty assigned by TRC = 1.5 K; TRC |
Tfus | 299.38 | K | N/A | Toops, 1956 | Uncertainty assigned by TRC = 0.06 K; TRC |
Enthalpy of vaporization
ΔvapH (kJ/mol) | Temperature (K) | Method | Reference | Comment |
---|---|---|---|---|
39.1 | 349. | EB | Stephenson and Malanowski, 1987 | Based on data from 334. to 401. K. See also Toops, 1956, 2 and Dykyj, 1971.; AC |
Enthalpy of fusion
ΔfusH (kJ/mol) | Temperature (K) | Reference | Comment |
---|---|---|---|
2.6 | 299.2 | Reuter, Büsing, et al., 1997 | AC |

References

Knobel, Miroshnichenko, et al., 1970
Knobel, Yu.K.; Miroshnichenko, E.A.; Lebedev, Yu.A.,
Heat of combustion of 2-methyl-2-nitropropane and dissociation of C - N bond in mononitro derovatoves of propane and butane,
Dokl. Phys. Chem. (Engl. Transl.), 1970, 190, 45-47, In original 348. [all data]
Pedley, Naylor, et al., 1986
Pedley, J.B.; Naylor, R.D.; Kirby, S.P.,
Thermochemical Data of Organic Compounds, Chapman and Hall, New York, 1986, 1-792. [all data]
Weast and Grasselli, 1989
CRC Handbook of Data on Organic Compounds, 2nd Editon, Weast,R.C and Grasselli, J.G., ed(s)., CRC Press, Inc., Boca Raton, FL, 1989, 1. [all data]
Frinton Laboratories Inc., 1986
Frinton Laboratories Inc.,
Catalog Number 11, Frinton Laboratories Inc., Vineland, NJ, 1986, 99. [all data]
Kornblum, Clutter, et al., 1956
Kornblum, N.; Clutter, R.J.; Jones, W.J.,
Synthesis of Tertiary Nitroparaffins,
J. Am. Chem. Soc., 1956, 78, 4003. [all data]
Toops, 1956
Toops, E.E.,
Physical Properties of High Purity Nitroparaffins,
J. Phys. Chem., 1956, 60, 304-6. [all data]
Kornblum, Smiley, et al., 1955
Kornblum, N.; Smiley, R.A.; Ungnade, H.E.; White, A.M.; Taub, B.,
The reaction of silver nitrite with secondary and tertiary alkyl halides,
J. Am. Chem. Soc., 1955, 77, 5528-33. [all data]
Stephenson and Malanowski, 1987
Stephenson, Richard M.; Malanowski, Stanislaw,
Handbook of the Thermodynamics of Organic Compounds, 1987, https://doi.org/10.1007/978-94-009-3173-2
. [all data]
Toops, 1956, 2
Toops, Emory E.,
Physical Properties of Eight High-Purity Nitroparaffins,
J. Phys. Chem., 1956, 60, 3, 304-306, https://doi.org/10.1021/j150537a012
. [all data]
Dykyj, 1971
Dykyj, J.,
Petrochemia, 1971, 11, 2, 27. [all data]
Reuter, Büsing, et al., 1997
Reuter, Jörg; Büsing, Dirk; Tamarit, Josep Ll.; Würflinger, Albert,
High-pressure differential thermal analysis study of the phase behaviour in sometert-butyl compounds: pivalic acid, 2-methylpropane-2-thiol and tert-butylamine,
J. Mater. Chem., 1997, 7, 1, 41, https://doi.org/10.1039/a604182e
. [all data]