1,1-dibromo-2,2,2-trichloroethane
- Formula: C2HBr2Cl3
- Molecular weight: 291.196
- IUPAC Standard InChIKey: KNRXBURHSINQHN-UHFFFAOYSA-N
- CAS Registry Number: 594-62-7
- Chemical structure:
View 3d structure (requires JavaScript / HTML 5) - Permanent link for this species. Use this link for bookmarking this species for future reference.

Phase change data

Data compiled by: Thermodynamics Research Center, NIST Boulder Laboratories, Chris Muzny director
Quantity | Value | Units | Method | Reference | Comment |
---|---|---|---|---|---|
Tfus | 268.65 | K | N/A | Timmermans, 1921 | Uncertainty assigned by TRC = 0.5 K |

References

Timmermans, 1921
Timmermans, J.,
The Freezing Points of Organic Substances IV. New Exp. Determinations,
Bull. Soc. Chim. Belg., 1921, 30, 62. [all data]