2,3-dibromo-2-methylbutane
- Formula: C5H10Br2
- Molecular weight: 229.941
- IUPAC Standard InChIKey: XLTWAJQKAGLQDX-UHFFFAOYSA-N
- CAS Registry Number: 594-51-4
- Chemical structure:
View 3d structure (requires JavaScript / HTML 5) - Species with the same structure:

Reaction thermochemistry data

Data compiled by: Hussein Y. Afeefy, Joel F. Liebman, and Stephen E. Stein
Individual Reactions
By formula: C5H10 + Br2 = C5H10Br2
Quantity | Value | Units | Method | Reference | Comment |
---|---|---|---|---|---|
ΔrH° | -127.2 ± 0.84 | kJ/mol | Cm | Conn, Kistiakowsky, et al., 1938 | gas phase; At 355 °K |
By formula: C5H10Br2 = HBr + C5H9Br
Quantity | Value | Units | Method | Reference | Comment |
---|---|---|---|---|---|
ΔrH° | 74. ± 2. | kJ/mol | Eqk | Meged, Levanova, et al., 1980 | gas phase |

References

Conn, Kistiakowsky, et al., 1938
Conn, J.B.; Kistiakowsky, G.B.; Smith, E.A.,
Heats of organic reactions. VII. Addition of halogens to olefins,
J. Am. Chem. Soc., 1938, 60, 2764-2771. [all data]
Meged, Levanova, et al., 1980
Meged, V.M.; Levanova, S.V.; Rozhnov, A.M.,
Dehydrohalogenation of dihalomethylbutanes. 2.,
Izv. Vyssh. Uchebn. Zaved., Khim. Khim. Tekhnol., 1980, 23, 149-151. [all data]