Propane, 1,2-dichloro-2-methyl-
- Formula: C4H8Cl2
- Molecular weight: 127.012
- IUPAC Standard InChIKey: OQPNDCHKFIHPBY-UHFFFAOYSA-N
- CAS Registry Number: 594-37-6
- Chemical structure:
View 3d structure (requires JavaScript / HTML 5) - Other names: 1,2-Dichloro-2-methylpropane; 1,2-Dichloroisobutane; Isobutylene dichloride

Phase change data

Data compiled as indicated in comments:
BS - Robert L. Brown and Stephen E. Stein
TRC - Thermodynamics Research Center, NIST Boulder Laboratories, Chris Muzny director
AC - William E. Acree, Jr., James S. Chickos
Quantity | Value | Units | Method | Reference | Comment |
---|---|---|---|---|---|
Tboil | 380. ± 1. | K | AVG | N/A | Average of 8 values; Individual data points |
Enthalpy of vaporization
ΔvapH (kcal/mol) | Temperature (K) | Method | Reference | Comment |
---|---|---|---|---|
9.66 | 262. | A | Stephenson and Malanowski, 1987 | Based on data from 247. to 381. K. See also Stull, 1947.; AC |
Antoine Equation Parameters
log10(P) = A − (B / (T + C))
P = vapor pressure (atm)
T = temperature (K)
View plot Requires a JavaScript / HTML 5 canvas capable browser.
Temperature (K) | A | B | C | Reference | Comment |
---|---|---|---|---|---|
247.4 to 381. | 4.42446 | 1502.307 | -41.641 | Stull, 1947 | Coefficents calculated by NIST from author's data. |

Van Den Dool and Kratz RI, non-polar column, temperature ramp

Data compiled by: NIST Mass Spectrometry Data Center, William E. Wallace, director

Column type Capillary
Active phase Petrocol DH
Column length (m) 100.
Carrier gas He
Substrate
Column diameter (mm) 0.25
Phase thickness (μm) 0.5
Tstart (C) 30.
Tend (C) 220.
Heat rate (K/min) 1.
Initial hold (min)
Final hold (min)
I 719.
ReferenceWhite, Hackett, et al., 1992
Comment MSDC-RI

Kovats' RI, non-polar column, isothermal

Data compiled by: NIST Mass Spectrometry Data Center, William E. Wallace, director

Column type Packed
Active phase Squalane
Column length (m) 3.
Carrier gas N2
Substrate Chromosorb W (60-80 mesh)
Column diameter (mm)
Phase thickness (μm)
Temperature (C) 110.
I 720.
ReferenceEngewald, Mai, et al., 1976
Comment MSDC-RI

References

Stephenson and Malanowski, 1987
Stephenson, Richard M.; Malanowski, Stanislaw,
Handbook of the Thermodynamics of Organic Compounds, 1987, https://doi.org/10.1007/978-94-009-3173-2
. [all data]
Stull, 1947
Stull, Daniel R.,
Vapor Pressure of Pure Substances. Organic and Inorganic Compounds,
Ind. Eng. Chem., 1947, 39, 4, 517-540, https://doi.org/10.1021/ie50448a022
. [all data]