Propane, 1,2-dibromo-2-methyl-
- Formula: C4H8Br2
- Molecular weight: 215.914
- IUPAC Standard InChIKey: SDTXSEXYPROZSZ-UHFFFAOYSA-N
- CAS Registry Number: 594-34-3
- Chemical structure:
View 3d structure (requires JavaScript / HTML 5) - Other names: Isobutylene bromide; 1,2-Dibromo-2-methylpropane; 1,2-Dibromoisobutane

Gas phase thermochemistry data

Data compiled by: Hussein Y. Afeefy, Joel F. Liebman, and Stephen E. Stein
Quantity | Value | Units | Method | Reference | Comment |
---|---|---|---|---|---|
ΔfH°gas | -113.3 ± 1.0 | kJ/mol | Cm | Sunner and Wulff, 1974 | Reanalyzed by Pedley, Naylor, et al., 1986, Original value = -114.2 ± 1.1 kJ/mol |

Condensed phase thermochemistry data

Data compiled by: Hussein Y. Afeefy, Joel F. Liebman, and Stephen E. Stein
Quantity | Value | Units | Method | Reference | Comment |
---|---|---|---|---|---|
ΔfH°liquid | -150.5 | kJ/mol | Eqk | Rozhnov, Nesterova, et al., 1975 | Gas phase isomerization |
ΔfH°liquid | -156.6 ± 1.0 | kJ/mol | Cm | Sunner and Wulff, 1974 | Reanalyzed by Pedley, Naylor, et al., 1986, Original value = -157.6 ± 1.1 kJ/mol |

Phase change data

Data compiled as indicated in comments:
BS - Robert L. Brown and Stephen E. Stein
TRC - Thermodynamics Research Center, NIST Boulder Laboratories, Chris Muzny director
ALS - Hussein Y. Afeefy, Joel F. Liebman, and Stephen E. Stein
AC - William E. Acree, Jr., James S. Chickos
Quantity | Value | Units | Method | Reference | Comment |
---|---|---|---|---|---|
Tboil | 423.2 | K | N/A | Weast and Grasselli, 1989 | BS |
Tboil | 423.2 | K | N/A | Majer and Svoboda, 1985 | |
Tboil | 422.15 | K | N/A | Timmermans, 1921 | Uncertainty assigned by TRC = 0.4 K; TRC |
Quantity | Value | Units | Method | Reference | Comment |
Tfus | 203.05 | K | N/A | Timmermans, 1921 | Uncertainty assigned by TRC = 0.3 K; TRC |
Tfus | 202.85 | K | N/A | Timmermans, 1921 | Uncertainty assigned by TRC = 0.3 K; TRC |
Quantity | Value | Units | Method | Reference | Comment |
ΔvapH° | 43.37 | kJ/mol | N/A | Majer and Svoboda, 1985 | |
ΔvapH° | 43.3 ± 0.1 | kJ/mol | C | Sunner and Wulff, 1974 | ALS |
Reduced pressure boiling point
Tboil (K) | Pressure (bar) | Reference | Comment |
---|---|---|---|
422.2 | 1.02 | Aldrich Chemical Company Inc., 1990 | BS |
Enthalpy of vaporization
ΔvapH (kJ/mol) | Temperature (K) | Method | Reference | Comment |
---|---|---|---|---|
33.3 | 259. | A | Stephenson and Malanowski, 1987 | Based on data from 244. to 422. K. See also Stull, 1947.; AC |
36.52 | 423.2 | N/A | Majer and Svoboda, 1985 |
Antoine Equation Parameters
log10(P) = A − (B / (T + C))
P = vapor pressure (bar)
T = temperature (K)
View plot Requires a JavaScript / HTML 5 canvas capable browser.
Temperature (K) | A | B | C | Reference | Comment |
---|---|---|---|---|---|
244.4 to 422. | 3.311 | 1264.121 | -39.921 | Stull, 1947 | Coefficents calculated by NIST from author's data. |

Reaction thermochemistry data

Data compiled by: Hussein Y. Afeefy, Joel F. Liebman, and Stephen E. Stein
Individual Reactions
By formula: C4H8Br2 = C4H8Br2
Quantity | Value | Units | Method | Reference | Comment |
---|---|---|---|---|---|
ΔrH° | -8.8 ± 0.3 | kJ/mol | Eqk | Rozhnov, Nesterova, et al., 1975 | liquid phase; Gas phase isomerization |
By formula: C4H8Br2 = HBr + C4H7Br
Quantity | Value | Units | Method | Reference | Comment |
---|---|---|---|---|---|
ΔrH° | 75.3 | kJ/mol | Cm | Levanova, Rozhnov, et al., 1975 | gas phase; Dehydrohalogenation |
By formula: C4H8Br2 = C4H8 + Br2
Quantity | Value | Units | Method | Reference | Comment |
---|---|---|---|---|---|
ΔrH° | 139.7 ± 0.46 | kJ/mol | Cm | Sunner and Wulff, 1974 | liquid phase |

Normal alkane RI, non-polar column, temperature ramp

Column type | Active phase | I | Reference | Comment |
---|---|---|---|---|
Capillary | HP-PONA | 865. | Liu and Yang, 2003 | 50. m/0.20 mm/0.50 μm, 35. C @ 8. min, 3.5 K/min, 230. C @ 10. min |

Normal alkane RI, non-polar column, custom temperature program

Column type | Active phase | I | Reference | Comment |
---|---|---|---|---|
Capillary | Methyl Silicone | 893. | Zenkevich and Marinichev, 2001 | Program: not specified |

References

Sunner and Wulff, 1974
Sunner, S.; Wulff, C.A.,
The enthalpy of formation of 1,1-dibromo-2-methylpropane,
J. Chem. Thermodyn., 1974, 6, 287-292. [all data]
Pedley, Naylor, et al., 1986
Pedley, J.B.; Naylor, R.D.; Kirby, S.P.,
Thermochemical Data of Organic Compounds, Chapman and Hall, New York, 1986, 1-792. [all data]
Rozhnov, Nesterova, et al., 1975
Rozhnov, A.M.; Nesterova, T.N.; Mukovnina, G.S.,
Equilibrium in the isomerisation of dibromoalkanes. II. Isomerisation of dibromoisobutanes,
Russ. J. Phys. Chem. (Engl. Transl.), 1975, 49, 1675-1676. [all data]
Weast and Grasselli, 1989
CRC Handbook of Data on Organic Compounds, 2nd Editon, Weast,R.C and Grasselli, J.G., ed(s)., CRC Press, Inc., Boca Raton, FL, 1989, 1. [all data]
Majer and Svoboda, 1985
Majer, V.; Svoboda, V.,
Enthalpies of Vaporization of Organic Compounds: A Critical Review and Data Compilation, Blackwell Scientific Publications, Oxford, 1985, 300. [all data]
Timmermans, 1921
Timmermans, J.,
The Freezing Points of Organic Substances IV. New Exp. Determinations,
Bull. Soc. Chim. Belg., 1921, 30, 62. [all data]
Aldrich Chemical Company Inc., 1990
Aldrich Chemical Company Inc.,
Catalog Handbook of Fine Chemicals, Aldrich Chemical Company, Inc., Milwaukee WI, 1990, 1. [all data]
Stephenson and Malanowski, 1987
Stephenson, Richard M.; Malanowski, Stanislaw,
Handbook of the Thermodynamics of Organic Compounds, 1987, https://doi.org/10.1007/978-94-009-3173-2
. [all data]
Stull, 1947
Stull, Daniel R.,
Vapor Pressure of Pure Substances. Organic and Inorganic Compounds,
Ind. Eng. Chem., 1947, 39, 4, 517-540, https://doi.org/10.1021/ie50448a022
. [all data]
Levanova, Rozhnov, et al., 1975
Levanova, S.V.; Rozhnov, A.M.; Plaksina, T.V.; Anisimova, Z.I.,
Dehydrohalogenation of some dihalo derivatives of isobutane,
Russ. J. Phys. Chem. (Engl. Transl.), 1975, 49, 1440-1441. [all data]
Liu and Yang, 2003
Liu, Y.; Yang, H.,
Detailed alkene determination by bromination and gas chromatography with atomic emission detection. I. identification of the bromoalkenes/bromoalkanes in brominated gasoline,
Se Pu - Chinese Journal of Chromatography, 2003, 21, 1, 1-8. [all data]
Zenkevich and Marinichev, 2001
Zenkevich, I.G.; Marinichev, A.N.,
Comparison of Topological and Dynamics Molecular Characteristics for Precalculation of Chromatographic Retention Parameters of Organic Compounds (in Russian),
Zh. Struct. Khim., 2001, 42, 5, 893-902. [all data]