1,1,2-tribromo-1-chloroethane
- Formula: C2H2Br3Cl
- Molecular weight: 301.202
- IUPAC Standard InChIKey: XPQHKKOIPFHLIX-UHFFFAOYSA-N
- CAS Registry Number: 594-33-2
- Chemical structure:
View 3d structure (requires JavaScript / HTML 5) - Permanent link for this species. Use this link for bookmarking this species for future reference.

Phase change data

Data compiled by: Thermodynamics Research Center, NIST Boulder Laboratories, Chris Muzny director
Quantity | Value | Units | Method | Reference | Comment |
---|---|---|---|---|---|
Tfus | 252.6 | K | N/A | Timmermans, 1921 | Uncertainty assigned by TRC = 0.3 K |

References

Timmermans, 1921
Timmermans, J.,
The Freezing Points of Organic Substances IV. New Exp. Determinations,
Bull. Soc. Chim. Belg., 1921, 30, 62. [all data]