Methane, trichloroiodo-
- Formula: CCl3I
- Molecular weight: 245.274
- IUPAC Standard InChIKey: SFLKZLQXODICBP-UHFFFAOYSA-N
- CAS Registry Number: 594-22-9
- Chemical structure:
View 3d structure (requires JavaScript / HTML 5) - Permanent link for this species. Use this link for bookmarking this species for future reference.

Vibrational and/or electronic energy levels

Data compiled by: Takehiko Shimanouchi
Symmetry: C3ν Symmetry Number σ = 3
Sym. | No | Approximate | Selected Freq. | Infrared | Raman | Comments | ||||
---|---|---|---|---|---|---|---|---|---|---|
Species | type of mode | Value | Rating | Value | Phase | Value | Phase | |||
a1 | 1 | CCl3 s-str | 684 | D | 684 VS | liq. | 687 W b p | liq. | ||
a1 | 2 | CI str | 390 | D | 390 M | liq. | 405 W p | liq. | ||
a1 | 3 | CCl3 s-deform | 224 | D | 224 W | liq. | 224 W | liq. | ||
e | 4 | CCl3 d-str | 755 | D | 755 VS | liq. | ||||
e | 5 | CCl3 d-deform | 284 | D | 284 W | liq. | 288 W dp | liq. | ||
e | 6 | CI bend | 188 | D | 188 M | liq. | ||||
Source: Shimanouchi, 1972

References

Shimanouchi, 1972
Shimanouchi, T.,
Tables of Molecular Vibrational Frequencies Consolidated Volume II,
J. Phys. Chem. Ref. Data, 1972, 6, 3, 993-1102. [all data]