Tribromochloromethane
- Formula: CBr3Cl
- Molecular weight: 287.176
- IUPAC Standard InChIKey: GKXZMEXQUWZGJK-UHFFFAOYSA-N
- CAS Registry Number: 594-15-0
- Chemical structure:
View 3d structure (requires JavaScript / HTML 5) - Permanent link for this species. Use this link for bookmarking this species for future reference.

Phase change data

Data compiled by: Thermodynamics Research Center, NIST Boulder Laboratories, Chris Muzny director
Quantity | Value | Units | Method | Reference | Comment |
---|---|---|---|---|---|
Tboil | 377.45 | K | N/A | Wouters, 1934 | Uncertainty assigned by TRC = 0.6 K |

Vibrational and/or electronic energy levels

Data compiled by: Takehiko Shimanouchi
Symmetry: C3ν Symmetry Number σ = 3
Sym. | No | Approximate | Selected Freq. | Infrared | Raman | Comments | ||||
---|---|---|---|---|---|---|---|---|---|---|
Species | type of mode | Value | Rating | Value | Phase | Value | Phase | |||
a1 | 1 | CCl str | 747 | C | 747 S | solid solid | 748 | solid solid | ||
a1 | 2 | CBr3 s-str | 329 | C | 329 W | solid solid | 326 p | solid solid | ||
a1 | 3 | CBr3 s-deform | 210 | C | 210 p | solid solid | ||||
e | 4 | CBr3 d-str | 675 | C | 675 S | solid solid | 677 dp | solid solid | ||
e | 5 | CCl bend | 211 | E | CF | |||||
e | 6 | CBr3 d-deform | 141 | C | 141 dp | solid solid | ||||
Source: Shimanouchi, 1972

Normal alkane RI, non-polar column, custom temperature program

Column type | Active phase | I | Reference | Comment |
---|---|---|---|---|
Capillary | Methyl Silicone | 955. | Zenkevich, 2001 | Program: not specified |

References

Wouters, 1934
Wouters, J.,
Bull. Cl. Sci., Acad. R. Belg., 1934, 20, 782. [all data]
Shimanouchi, 1972
Shimanouchi, T.,
Tables of Molecular Vibrational Frequencies Consolidated Volume I, National Bureau of Standards, 1972, 1-160. [all data]
Zenkevich, 2001
Zenkevich, I.G.,
Comparative Characterization of Conditions for Unambuguous Chromatographic Identification of Organic Compounds,
Zh. Anal. Khim., 2001, 56, 9, 915-924. [all data]