trithiocarbonic acid
- Formula: CH2S3
- Molecular weight: 110.222
- IUPAC Standard InChIKey: HIZCIEIDIFGZSS-UHFFFAOYSA-N
- CAS Registry Number: 594-08-1
- Chemical structure:
View 3d structure (requires JavaScript / HTML 5) - Other names: Carbonotrithioic-acid-

Condensed phase thermochemistry data

Data compiled as indicated in comments:
ALS - Hussein Y. Afeefy, Joel F. Liebman, and Stephen E. Stein
DH - Eugene S. Domalski and Elizabeth D. Hearing
Quantity | Value | Units | Method | Reference | Comment |
---|---|---|---|---|---|
ΔfH°liquid | 24.0 ± 1.5 | kJ/mol | Cm | Gattow and Krebes, 1963 | Reanalyzed by Cox and Pilcher, 1970, Original value = 26. ± 5.0 kJ/mol; ALS |
Quantity | Value | Units | Method | Reference | Comment |
S°liquid | 218. | J/mol*K | N/A | Gattow and Krebs, 1963 | Extrapolation below -95°C. Estimated uncertainty ± 25 J/mol*K.; DH |
Constant pressure heat capacity of liquid
Cp,liquid (J/mol*K) | Temperature (K) | Reference | Comment |
---|---|---|---|
146.5 | 273. | Gattow and Krebs, 1963 | T = -95 to 20°C.; DH |

Phase change data

Data compiled as indicated in comments:
TRC - Thermodynamics Research Center, NIST Boulder Laboratories, Chris Muzny director
DH - Eugene S. Domalski and Elizabeth D. Hearing
Quantity | Value | Units | Method | Reference | Comment |
---|---|---|---|---|---|
Tfus | 246.3 | K | N/A | Gattow and Krebes, 1963 | Uncertainty assigned by TRC = 0.5 K; TRC |
Enthalpy of fusion
ΔfusH (kJ/mol) | Temperature (K) | Reference | Comment |
---|---|---|---|
8.410 | 246.3 | Gattow and Krebs, 1963 | DH |
Entropy of fusion
ΔfusS (J/mol*K) | Temperature (K) | Reference | Comment |
---|---|---|---|
34.1 | 246.3 | Gattow and Krebs, 1963 | DH |

Reaction thermochemistry data

Data compiled by: Hussein Y. Afeefy, Joel F. Liebman, and Stephen E. Stein
Individual Reactions
Quantity | Value | Units | Method | Reference | Comment |
---|---|---|---|---|---|
ΔrH° | 44. ± 1. | kJ/mol | Cm | Gattow and Krebes, 1963 | liquid phase |

References

Gattow and Krebes, 1963
Gattow, V.G.; Krebes, B.,
Das kohlenstoffsulfid-di-(hydrogensulfid) SC(SH)2 und das system H2S-CS2. 2. Thermochemie des SC(SH)2,
Z. Anorg. Allg. Chem., 1963, 322, 113. [all data]
Cox and Pilcher, 1970
Cox, J.D.; Pilcher, G.,
Thermochemistry of Organic and Organometallic Compounds, Academic Press, New York, 1970, 1-636. [all data]
Gattow and Krebs, 1963
Gattow, G.; Krebs, B.,
Das Kohlenstoffsulfid-di-(hydrogensulfid)SC(SH)2 und das System H2S-CS2. part 2. Thermochemie des SC(SH)2,
Z. anorg. allgem. Chem., 1963, 322, 113-128. [all data]