Bismuthine, trimethyl-
- Formula: C3H9Bi
- Molecular weight: 254.0840
- IUPAC Standard InChIKey: AYDYYQHYLJDCDQ-UHFFFAOYSA-N
- CAS Registry Number: 593-91-9
- Chemical structure:

Condensed phase thermochemistry data

Data compiled by: José A. Martinho Simões
Quantity | Value | Units | Method | Reference | Comment |
---|---|---|---|---|---|
ΔfH°liquid | 158. ± 14. | kJ/mol | Review | Martinho Simões | |
Quantity | Value | Units | Method | Reference | Comment |
ΔcH°liquid | -2912. ± 14. | kJ/mol | CC-SB | Long and Sackman, 1954 | Please also see Pedley and Rylance, 1977 and Cox and Pilcher, 1970. |

Phase change data

Data compiled as indicated in comments:
MS - José A. Martinho Simões
AC - William E. Acree, Jr., James S. Chickos
Quantity | Value | Units | Method | Reference | Comment |
---|---|---|---|---|---|
ΔvapH° | 36.0 ± 1.3 | kJ/mol | CC-SB | Amberger, 1961 | MS |
ΔvapH° | 35.8 | kJ/mol | N/A | Amberger, 1961, 2 | Based on data from 215. to 380. K.; AC |

Gas phase thermochemistry data

Data compiled by: José A. Martinho Simões
Quantity | Value | Units | Method | Reference | Comment |
---|---|---|---|---|---|
ΔfH°gas | 194. ± 14. | kJ/mol | Review | Martinho Simões |

Reaction thermochemistry data

Data compiled by: José A. Martinho Simões
Individual Reactions
(g) = C2H6Bi (g) +
(g)
By formula: C3H9Bi (g) = C2H6Bi (g) + CH4 (g)
Quantity | Value | Units | Method | Reference | Comment |
---|---|---|---|---|---|
ΔrH° | 50.0 to 53.1 | kcal/mol | N/A | Smith and Patrick, 1983 | |
ΔrH° | 52.0 ± 4.0 | kcal/mol | N/A | McMillen and Golden, 1982 |

References

Martinho Simões
Martinho Simões, J.A.,
Private communication (see http://webbook.nist.gov/chemistry/om/). [all data]
Long and Sackman, 1954
Long, L.H.; Sackman, J.F.,
The heat of formation of bismuth trimethyl,
Trans. Faraday Soc., 1954, 50, 1177, https://doi.org/10.1039/tf9545001177
. [all data]
Pedley and Rylance, 1977
Pedley, J.B.; Rylance, J.,
Computer Analysed Thermochemical Data: Organic and Organometallic Compounds, University of Sussex, Brigton, 1977. [all data]
Cox and Pilcher, 1970
Cox, J.D.; Pilcher, G.,
Thermochemistry of Organic and Organometallic Compounds
in Academic Press, New York, 1970. [all data]
Amberger, 1961
Amberger, E.,
Chem. Ber., 1961, 94, 1447. [all data]
Amberger, 1961, 2
Amberger, Eberhard,
Hydride des Wismuts,
Chem. Ber., 1961, 94, 6, 1447-1452, https://doi.org/10.1002/cber.19610940607
. [all data]