2,7-Dimethyloctan-4-one
- Formula: C10H20O
- Molecular weight: 156.2652
- IUPAC Standard InChIKey: FSDBXGZREACSJJ-UHFFFAOYSA-N
- CAS Registry Number: 59387-92-7
- Chemical structure:
View 3d structure (requires JavaScript / HTML 5) - Permanent link for this species. Use this link for bookmarking this species for future reference.

Phase change data

Data compiled by: Thermodynamics Research Center, NIST Boulder Laboratories, Chris Muzny director
Quantity | Value | Units | Method | Reference | Comment |
---|---|---|---|---|---|
Tboil | 470. | K | N/A | Powell and Hagemann, 1944 | Uncertainty assigned by TRC = 4. K |

References

Powell and Hagemann, 1944
Powell, S.G.; Hagemann, F.,
The Condensation of Isobutyraldehyde with Aliphatic Ketones,
J. Am. Chem. Soc., 1944, 66, 372. [all data]