(Trichloromethyl)trimethylsilane

Phase change data

Data compiled by: William E. Acree, Jr., James S. Chickos

Enthalpy of fusion

ΔfusH (kJ/mol) Temperature (K) Method Reference
7.36405.3DTA,DSCBräuninger, Dou, et al., 2010

References

Bräuninger, Dou, et al., 2010
Bräuninger, Sigmar; Dou, Shi-Qi; Fuess, Hartmut; Schmahl, Wolfgang; Strauß, Roman; Weiss, Alarich, Orientational disorder in solids composed of the ellipsoid-shaped molecules trichloromethyltrimethylsilane, Cl3CSi(CH3)3, t-Butyltrichlorosilane, (CH3)3CSiCl3, and t-Butyldimethylchlorosilane, (CH3)3CSi(CH3)2Cl, Berichte der Bunsengesellschaft für physikalische Chemie, 2010, 98, 8, 1096-1099, https://doi.org/10.1002/bbpc.19940980817 . [all data]