Vinyl bromide
- Formula: C2H3Br
- Molecular weight: 106.949
- IUPAC Standard InChIKey: INLLPKCGLOXCIV-UHFFFAOYSA-N
- CAS Registry Number: 593-60-2
- Chemical structure:
View 3d structure (requires JavaScript / HTML 5) - Other names: Ethene, bromo-; Ethylene, bromo-; Bromoethene; Bromoethylene; C2H3Br; Bromure de vinyle; NCI-C50373; UN 1085; Vinylbromid; Saytex VBR

Gas phase thermochemistry data

Data compiled by: Hussein Y. Afeefy, Joel F. Liebman, and Stephen E. Stein
Quantity | Value | Units | Method | Reference | Comment |
---|---|---|---|---|---|
ΔfH°gas | 79.2 ± 1.9 | kJ/mol | Chyd | Lacher, Kianpour, et al., 1957 | Reanalyzed by Cox and Pilcher, 1970, Original value = 78.2 ± 1.9 kJ/mol |

Condensed phase thermochemistry data

Data compiled by: Eugene S. Domalski and Elizabeth D. Hearing
Constant pressure heat capacity of liquid
Cp,liquid (J/mol*K) | Temperature (K) | Reference | Comment |
---|---|---|---|
107.5 | 288. | Mehl, 1934 | |
107.9 | 288. | Mehl, 1934, 2 | One measurement. |

Phase change data

Data compiled as indicated in comments:
BS - Robert L. Brown and Stephen E. Stein
TRC - Thermodynamics Research Center, NIST Boulder Laboratories, Chris Muzny director
AC - William E. Acree, Jr., James S. Chickos
Quantity | Value | Units | Method | Reference | Comment |
---|---|---|---|---|---|
Tboil | 289. | K | N/A | PCR Inc., 1990 | BS |
Tboil | 289.0 | K | N/A | Weast and Grasselli, 1989 | BS |
Quantity | Value | Units | Method | Reference | Comment |
Tfus | 133.61 | K | N/A | Dreisbach, 1955 | Uncertainty assigned by TRC = 0.02 K; TRC |
Reduced pressure boiling point
Tboil (K) | Pressure (bar) | Reference | Comment |
---|---|---|---|
289.2 | 1.00 | Aldrich Chemical Company Inc., 1990 | BS |
Enthalpy of vaporization
ΔvapH (kJ/mol) | Temperature (K) | Method | Reference | Comment |
---|---|---|---|---|
27.3 | 239. | A | Stephenson and Malanowski, 1987 | Based on data from 224. to 319. K. See also Dykyj, 1970.; AC |
24.8 | 274. | N/A | Guyer, Sch«65533»tze, et al., 1937 | Based on data from 186. to 289. K. See also Boublik, Fried, et al., 1984.; AC |
26.9 | 270. | N/A | Mehl, 1934, 3 | Based on data from 207. to 285. K. See also Boublik, Fried, et al., 1984.; AC |
Antoine Equation Parameters
log10(P) = A − (B / (T + C))
P = vapor pressure (bar)
T = temperature (K)
View plot Requires a JavaScript / HTML 5 canvas capable browser.
Temperature (K) | A | B | C | Reference | Comment |
---|---|---|---|---|---|
185.7 to 289. | 4.36869 | 1219.308 | -9.129 | Guyer, Sch«65533»tze, et al., 1937 | Coefficents calculated by NIST from author's data. |

Reaction thermochemistry data

Data compiled by: Hussein Y. Afeefy, Joel F. Liebman, and Stephen E. Stein
Individual Reactions
By formula: C2H4BrCl = C2H3Br + HCl
Quantity | Value | Units | Method | Reference | Comment |
---|---|---|---|---|---|
ΔrH° | 66. ± 2. | kJ/mol | Eqk | Busheva, Levanova, et al., 1980 | gas phase; Dehydrohalogenation |
By formula: 2H2 + C2H3Br = HBr + C2H6
Quantity | Value | Units | Method | Reference | Comment |
---|---|---|---|---|---|
ΔrH° | -199.2 ± 1.9 | kJ/mol | Chyd | Lacher, Kianpour, et al., 1957 | gas phase |
By formula: C2H4Br2 = HBr + C2H3Br
Quantity | Value | Units | Method | Reference | Comment |
---|---|---|---|---|---|
ΔrH° | 70. ± 3. | kJ/mol | Eqk | Levanova, Rozhnov, et al., 1970 | gas phase |
By formula: C2H4Br2 = HBr + C2H3Br
Quantity | Value | Units | Method | Reference | Comment |
---|---|---|---|---|---|
ΔrH° | 80. ± 2. | kJ/mol | Eqk | Levanova, Rozhnov, et al., 1970 | gas phase |

Gas phase ion energetics data

Data evaluated as indicated in comments:
L - Sharon G. Lias
Data compiled as indicated in comments:
LBLHLM - Sharon G. Lias, John E. Bartmess, Joel F. Liebman, John L. Holmes, Rhoda D. Levin, and W. Gary Mallard
LLK - Sharon G. Lias, Rhoda D. Levin, and Sherif A. Kafafi
RDSH - Henry M. Rosenstock, Keith Draxl, Bruce W. Steiner, and John T. Herron
Quantity | Value | Units | Method | Reference | Comment |
---|---|---|---|---|---|
IE (evaluated) | 9.82 ± 0.03 | eV | N/A | N/A | L |
Ionization energy determinations
IE (eV) | Method | Reference | Comment |
---|---|---|---|
9.90 ± 0.01 | S | Schander and Russell, 1976 | LLK |
9.80 | PE | Lohr, Jochims, et al., 1975 | LLK |
9.83 | PE | Mines and Thompson, 1973 | LLK |
9.80 ± 0.02 | PE | Chadwick, Frost, et al., 1972 | LLK |
9.82 ± 0.02 | PI | Momigny, 1963 | RDSH |
9.80 ± 0.01 | PI | Watanabe, Nakayama, et al., 1962 | RDSH |
9.80 | PI | Bralsford, Harris, et al., 1960 | RDSH |
9.9 | PE | Cambi, Ciullo, et al., 1983 | Vertical value; LBLHLM |
9.9 | PE | Von Niessen, Asbrink, et al., 1982 | Vertical value; LBLHLM |
9.87 | PE | Wittel and Bock, 1974 | Vertical value; LLK |
Appearance energy determinations
Ion | AE (eV) | Other Products | Method | Reference | Comment |
---|---|---|---|---|---|
HBr+ | 18.2 ± 0.1 | ? | PI | Lohr, Jochims, et al., 1975 | LLK |
C2H2+ | 12.5 ± 0.2 | HBr | PI | Lohr, Jochims, et al., 1975 | LLK |
C2H3+ | 11.92 | Br | DER | Miller and Baer, 1984 | T = 0K; LBLHLM |
C2H3+ | 11.9 ± 0.1 | Br | PI | Lohr, Jochims, et al., 1975 | LLK |
C2H3+ | 12.01 ± 0.13 | Br | EI | Finney and Harrison, 1972 | LLK |
C2H3+ | 11.9 | Br | EI | Lossing, 1971 | LLK |

Normal alkane RI, non-polar column, custom temperature program

View large format table.

Column type Active phase I Reference Comment
CapillaryOV-1, SE-30, Methyl silicone, SP-2100, OV-101, DB-1, etc.450.Waggott and Davies, 1984Hydrogen; Column length: 50. m; Column diameter: 0.32 mm; Program: not specified

References

Lacher, Kianpour, et al., 1957
Lacher, J.R.; Kianpour, A.; Montgomery, P.; Knedler, H.; Park, J.D.,
Reaction heats of organic halogen compounds. IX. The catalytic hydrogenation of vinyl and perfluorovinyl bromide,
J. Phys. Chem., 1957, 61, 1125-1126. [all data]
Cox and Pilcher, 1970
Cox, J.D.; Pilcher, G.,
Thermochemistry of Organic and Organometallic Compounds, Academic Press, New York, 1970, 1-636. [all data]
Mehl, 1934
Mehl, W.,
Die spezifische Wärme einiger flüssiger Kältemittel,
Z. ges. Kalte-Ind., 1934, 41, 152-153. [all data]
Mehl, 1934, 2
Mehl, W.,
Physikalishce Eigenschaften des Vinylbromids,
Z. Phys. Chem., 1934, A169, 312-313. [all data]
PCR Inc., 1990
PCR Inc.,
Research Chemicals Catalog 1990-1991, PCR Inc., Gainesville, FL, 1990, 1. [all data]
Weast and Grasselli, 1989
CRC Handbook of Data on Organic Compounds, 2nd Editon, Weast,R.C and Grasselli, J.G., ed(s)., CRC Press, Inc., Boca Raton, FL, 1989, 1. [all data]
Dreisbach, 1955
Dreisbach, R.R.,
Physical Properties of Chemical Compounds, Advances in Chemistry Series No. 15, Am. Chem. Soc.: Washington, D. C., 1955. [all data]
Aldrich Chemical Company Inc., 1990
Aldrich Chemical Company Inc.,
Catalog Handbook of Fine Chemicals, Aldrich Chemical Company, Inc., Milwaukee WI, 1990, 1. [all data]
Stephenson and Malanowski, 1987
Stephenson, Richard M.; Malanowski, Stanislaw,
Handbook of the Thermodynamics of Organic Compounds, 1987, https://doi.org/10.1007/978-94-009-3173-2
. [all data]
Dykyj, 1970
Dykyj, J.,
Petrochemica, 1970, 10, 2, 51. [all data]
Guyer, Sch«65533»tze, et al., 1937
Guyer, A.; Sch«65533»tze, H.; Weidenmann, M.,
«65533»ber einige thermische Eigenschaften des Vinylbromids,
Helv. Chim. Acta, 1937, 20, 1, 936-949, https://doi.org/10.1002/hlca.193702001136
. [all data]
Boublik, Fried, et al., 1984
Boublik, T.; Fried, V.; Hala, E.,
The Vapour Pressures of Pure Substances: Selected Values of the Temperature Dependence of the Vapour Pressures of Some Pure Substances in the Normal and Low Pressure Region, 2nd ed., Elsevier, New York, 1984, 972. [all data]
Mehl, 1934, 3
Mehl, W.,
Z. Phys. Chem. Abt. A, 1934, 164, 312. [all data]
Busheva, Levanova, et al., 1980
Busheva, L.I.; Levanova, S.V.; Rodova, R.M.; Rozhnov, A.M.,
Thermocatalytic reactions of 1,1-bromochloroethane,
Russ. J. Phys. Chem. (Engl. Transl.), 1980, 54, 1403-1404. [all data]
Levanova, Rozhnov, et al., 1970
Levanova, S.V.; Rozhnov, A.M.; Sedov, S.M.; Starkov, V.Ya.; Manzohos, V.N.,
Equilibrium reactions of dibromoethane,
Izv. Vyssh. Uchebn. Zaved., Khim. Khim. Tekhnol., 1970, 13, 62-65. [all data]