Lead anion
- Formula: Pb-
- Molecular weight: 207.2
- CAS Registry Number: 59359-31-8

Gas phase thermochemistry data

Data compiled as indicated in comments:
B - John E. Bartmess
Quantity | Value | Units | Method | Reference | Comment |
---|---|---|---|---|---|
ΔfH°gas | 160.0 ± 1.1 | kJ/mol | R-EA | Feigerle, Corderman, et al., 1981 | B |
Quantity | Value | Units | Method | Reference | Comment |
S°gas,1 bar | 186.90 | J/mol*K | Review | Chase, 1998 | Data last reviewed in March, 1983 |

Gas phase ion energetics data

Data compiled by: John E. Bartmess
Protonation reactions
Pb- + = HPb
Quantity | Value | Units | Method | Reference | Comment |
---|---|---|---|---|---|
ΔrH° | 1454. ± 8.4 | kJ/mol | D-EA | Feigerle, Corderman, et al., 1981 | gas phase |

References

Feigerle, Corderman, et al., 1981
Feigerle, C.S.; Corderman, R.R.; Lineberger, W.C.,
Electron affinities of B, Al, Bi, and Pb,
J. Chem. Phys., 1981, 74, 2, 1513, https://doi.org/10.1063/1.441174
. [all data]
Chase, 1998
Chase, M.W., Jr.,
NIST-JANAF Themochemical Tables, Fourth Edition,
J. Phys. Chem. Ref. Data, Monograph 9, 1998, 1-1951. [all data]