1,1'-Diphenyl-1,1'-bicyclooctyl
- Formula: C28H38
- Molecular weight: 374.6013
- IUPAC Standard InChIKey: SKPRQLZOAQUBAG-UHFFFAOYSA-N
- CAS Registry Number: 59358-73-5
- Chemical structure:
View 3d structure (requires JavaScript / HTML 5) - Permanent link for this species. Use this link for bookmarking this species for future reference.

Gas phase thermochemistry data

Data compiled by: Hussein Y. Afeefy, Joel F. Liebman, and Stephen E. Stein
Quantity | Value | Units | Method | Reference | Comment |
---|---|---|---|---|---|
ΔfH°gas | 69. ± 3. | kJ/mol | Ccb | Kratt, Beckhaus, et al., 1983 | ΔHfussion = 8.6±0.1 kcal/mol at 159°C |

Condensed phase thermochemistry data

Data compiled as indicated in comments:
ALS - Hussein Y. Afeefy, Joel F. Liebman, and Stephen E. Stein
DH - Eugene S. Domalski and Elizabeth D. Hearing
Quantity | Value | Units | Method | Reference | Comment |
---|---|---|---|---|---|
ΔfH°solid | -104.9 ± 2.3 | kJ/mol | Ccb | Kratt, Beckhaus, et al., 1983 | ΔHfussion = 8.6±0.1 kcal/mol at 159°C; ALS |
Quantity | Value | Units | Method | Reference | Comment |
ΔcH°solid | -16344.1 ± 2.3 | kJ/mol | Ccb | Kratt, Beckhaus, et al., 1983 | ΔHfussion = 8.6±0.1 kcal/mol at 159°C; Corresponding ΔfHºsolid = -104.9 kJ/mol (simple calculation by NIST; no Washburn corrections); ALS |
Constant pressure heat capacity of solid
Cp,solid (J/mol*K) | Temperature (K) | Reference | Comment |
---|---|---|---|
453.8 | 298. | Kratt, Beckhaus, et al., 1983, 2 | Cp given as 0.313 cal/g*K.; DH |

Phase change data

Data compiled as indicated in comments:
ALS - Hussein Y. Afeefy, Joel F. Liebman, and Stephen E. Stein
DRB - Donald R. Burgess, Jr.
AC - William E. Acree, Jr., James S. Chickos
Quantity | Value | Units | Method | Reference | Comment |
---|---|---|---|---|---|
ΔsubH° | 174. | kJ/mol | E | Kratt, Beckhaus, et al., 1983 | ΔHfussion = 8.6±0.1 kcal/mol at 159°C; ALS |
ΔsubH° | 173.9 | kJ/mol | N/A | Kratt, Beckhaus, et al., 1983 | DRB |
Enthalpy of fusion
ΔfusH (kJ/mol) | Temperature (K) | Method | Reference | Comment |
---|---|---|---|---|
35.98 | 432. | DSC | Kratt, Beckhaus, et al., 1983, 2 | AC |

References

Kratt, Beckhaus, et al., 1983
Kratt, G.; Beckhaus, H.D.; Bernlohr, W.; Ruchardt, C.,
Thermolabile kohlenwasserstoffe. XVII. Verbrennungsenthalpie und bildungsenthalpie von zehn sym.-tetraalkyl-1,2-diarylethanen,
Thermochim. Acta, 1983, 62, 279-194. [all data]
Kratt, Beckhaus, et al., 1983, 2
Kratt, G.; Beckhaus, H.D.; Bernioehr, W.; Ruechardt, C.,
Thermolabile hydrocarbons. XVII. Enthalpies of combustion and formation of ten sym-tetraalkyl-1,2-diarylethanes,
Thermochim. Acta, 1983, 62, 279-294. [all data]