1,1'-Diphenyl-1,1'-bicyclohexyl
- Formula: C24H30
- Molecular weight: 318.4950
- IUPAC Standard InChIKey: SZGBUFROANKUNE-UHFFFAOYSA-N
- CAS Registry Number: 59358-71-3
- Chemical structure:
View 3d structure (requires JavaScript / HTML 5) - Permanent link for this species. Use this link for bookmarking this species for future reference.

Gas phase thermochemistry data

Data compiled by: Hussein Y. Afeefy, Joel F. Liebman, and Stephen E. Stein
Quantity | Value | Units | Method | Reference | Comment |
---|---|---|---|---|---|
ΔfH°gas | 44. ± 3. | kJ/mol | Ccb | Kratt, Beckhaus, et al., 1983 | ΔHfussion = 7.1±0.1 kcal/mol at 182°C |

Condensed phase thermochemistry data

Data compiled as indicated in comments:
ALS - Hussein Y. Afeefy, Joel F. Liebman, and Stephen E. Stein
DH - Eugene S. Domalski and Elizabeth D. Hearing
Quantity | Value | Units | Method | Reference | Comment |
---|---|---|---|---|---|
ΔfH°solid | -106.9 ± 1.6 | kJ/mol | Ccb | Kratt, Beckhaus, et al., 1983 | ΔHfussion = 7.1±0.1 kcal/mol at 182°C; ALS |
Quantity | Value | Units | Method | Reference | Comment |
ΔcH°solid | -13624.8 ± 1.6 | kJ/mol | Ccb | Kratt, Beckhaus, et al., 1983 | ΔHfussion = 7.1±0.1 kcal/mol at 182°C; Corresponding ΔfHºsolid = -106.9 kJ/mol (simple calculation by NIST; no Washburn corrections); ALS |
Constant pressure heat capacity of solid
Cp,solid (J/mol*K) | Temperature (K) | Reference | Comment |
---|---|---|---|
403.8 | 298. | Kratt, Beckhaus, et al., 1983, 2 | Cp given as 0.303 cal/g*K.; DH |

Phase change data

Data compiled as indicated in comments:
TRC - Thermodynamics Research Center, NIST Boulder Laboratories, Chris Muzny director
ALS - Hussein Y. Afeefy, Joel F. Liebman, and Stephen E. Stein
DRB - Donald R. Burgess, Jr.
AC - William E. Acree, Jr., James S. Chickos
Quantity | Value | Units | Method | Reference | Comment |
---|---|---|---|---|---|
Tfus | 455. | K | N/A | Kratt, Beckhaus, et al., 1983, 2 | Uncertainty assigned by TRC = 1. K; TRC |
Quantity | Value | Units | Method | Reference | Comment |
ΔsubH° | 150. | kJ/mol | E | Kratt, Beckhaus, et al., 1983 | ΔHfussion = 7.1±0.1 kcal/mol at 182°C; ALS |
ΔsubH° | 150.9 | kJ/mol | N/A | Kratt, Beckhaus, et al., 1983 | DRB |
Enthalpy of fusion
ΔfusH (kJ/mol) | Temperature (K) | Method | Reference | Comment |
---|---|---|---|---|
29.71 | 455. | DSC | Kratt, Beckhaus, et al., 1983, 2 | AC |

References

Kratt, Beckhaus, et al., 1983
Kratt, G.; Beckhaus, H.D.; Bernlohr, W.; Ruchardt, C.,
Thermolabile kohlenwasserstoffe. XVII. Verbrennungsenthalpie und bildungsenthalpie von zehn sym.-tetraalkyl-1,2-diarylethanen,
Thermochim. Acta, 1983, 62, 279-194. [all data]
Kratt, Beckhaus, et al., 1983, 2
Kratt, G.; Beckhaus, H.D.; Bernioehr, W.; Ruechardt, C.,
Thermolabile hydrocarbons. XVII. Enthalpies of combustion and formation of ten sym-tetraalkyl-1,2-diarylethanes,
Thermochim. Acta, 1983, 62, 279-294. [all data]