6-Octadecenoic acid, (Z)-

Phase change data

Data compiled as indicated in comments:
DH - Eugene S. Domalski and Elizabeth D. Hearing
AC - William E. Acree, Jr., James S. Chickos

Quantity Value Units Method Reference Comment
Tfus301.65KN/ASato, Yoshimoto, et al., 1990Low-melting form.; DH

Enthalpy of fusion

ΔfusH (kJ/mol) Temperature (K) Reference Comment
47.500303.65Sato, Yoshimoto, et al., 1990High-melting form.; DH
59.9302.3Moore, Koelmel, et al., 2007AC
47.5303.7Domalski and Hearing, 1996AC

Entropy of fusion

ΔfusS (J/mol*K) Temperature (K) Reference Comment
156.4303.65Sato, Yoshimoto, et al., 1990High-melting; DH

References

Sato, Yoshimoto, et al., 1990
Sato, K.; Yoshimoto, N.; Suzuki, M.; Kobayashi, M.; Kaneko, F., Structure and transformation in polymorphism of petroselinic acid (cis-w-12-octadecenoic acid), J. Phys. Chem., 1990, 94, 3180-3185. [all data]

Moore, Koelmel, et al., 2007
Moore, David J.; Koelmel, Donald; Laura, Donna; Bedford, Eilidh, Infrared spectroscopy and differential scanning calorimetry studies of binary combinations of cis-6-octadecenoic acid and octadecanoic acid, Chemistry and Physics of Lipids, 2007, 150, 1, 109-115, https://doi.org/10.1016/j.chemphyslip.2007.06.217 . [all data]

Domalski and Hearing, 1996
Domalski, Eugene S.; Hearing, Elizabeth D., Heat Capacities and Entropies of Organic Compounds in the Condensed Phase. Volume III, J. Phys. Chem. Ref. Data, 1996, 25, 1, 1, https://doi.org/10.1063/1.555985 . [all data]