4-Nonanol
- Formula: C9H20O
- Molecular weight: 144.2545
- IUPAC Standard InChIKey: IXUOEGRSQCCEHB-UHFFFAOYSA-N
- CAS Registry Number: 5932-79-6
- Chemical structure:
View 3d structure (requires JavaScript / HTML 5) - Stereoisomers:
- Other names: nonan-4-ol

Phase change data

Data compiled as indicated in comments:
TRC - Thermodynamics Research Center, NIST Boulder Laboratories, Chris Muzny director
AC - William E. Acree, Jr., James S. Chickos
Quantity | Value | Units | Method | Reference | Comment |
---|---|---|---|---|---|
Tboil | 465.65 | K | N/A | Pexsters, 1906 | Uncertainty assigned by TRC = 3. K; TRC |
Quantity | Value | Units | Method | Reference | Comment |
Tc | 645. ± 1. | K | N/A | Gude and Teja, 1995 | |
Tc | 645.1 | K | N/A | Teja, Lee, et al., 1989 | TRC |
Tc | 645.1 | K | N/A | Anselme and Teja, 1988 | Uncertainty assigned by TRC = 0.3 K; TRC |
Quantity | Value | Units | Method | Reference | Comment |
Vc | 0.575 | l/mol | N/A | Gude and Teja, 1995 | |
Quantity | Value | Units | Method | Reference | Comment |
ρc | 1.74 | mol/l | N/A | Gude and Teja, 1995 | |
ρc | 1.74 | mol/l | N/A | Anselme and Teja, 1988 | Uncertainty assigned by TRC = 0.04 mol/l; TRC |
Quantity | Value | Units | Method | Reference | Comment |
ΔvapH° | 71.5 ± 0.3 | kJ/mol | GS | Verevkin and Schick, 2007 | Based on data from 285. to 324. K.; AC |

Kovats' RI, non-polar column, temperature ramp

Column type | Active phase | I | Reference | Comment |
---|---|---|---|---|
Capillary | HP-5 | 1078. | Mahmood, Kaul, et al., 2004 | 30. m/0.25 mm/0.25 μm, He, 50. C @ 5. min, 3. K/min, 280. C @ 25. min |

Kovats' RI, polar column, temperature ramp

Column type | Active phase | I | Reference | Comment |
---|---|---|---|---|
Capillary | Innowax | 1467. | Mahmood, Kaul, et al., 2004 | 30. m/0.25 mm/0.25 μm, He, 5. K/min, 190. C @ 5. min; Tstart: 40. C |

Normal alkane RI, polar column, temperature ramp

Column type | Active phase | I | Reference | Comment |
---|---|---|---|---|
Capillary | Innowax | 1479. | Baser, Özek, et al., 2000 | 60. m/0.25 mm/0.25 μm, He, 60. C @ 10. min, 4. K/min, 220. C @ 10. min |

Normal alkane RI, polar column, custom temperature program

Column type | Active phase | I | Reference | Comment |
---|---|---|---|---|
Capillary | PEG-20M | 1474. | Qin, 2009 | Program: not specified |

References

Pexsters, 1906
Pexsters, M.,
Bull. Cl. Sci., 1906, 1906, 796. [all data]
Gude and Teja, 1995
Gude, M.; Teja, A.S.,
Vapor-Liquid Critical Properties of Elements and Compounds. 4. Aliphatic Alkanols,
J. Chem. Eng. Data, 1995, 40, 1025-1036. [all data]
Teja, Lee, et al., 1989
Teja, A.S.; Lee, R.J.; Rosenthal, D.J.; Anselme, M.J.,
Correlation of the Critical Properties of Alkanes and Alkanols
in 5th IUPAC Conference on Alkanes and AlkanolsGradisca, 1989. [all data]
Anselme and Teja, 1988
Anselme, M.J.; Teja, A.S.,
Critical Temperatures and Densities of Isomeric Alkanols with Six to Ten Carbon Atoms,
Fluid Phase Equilib., 1988, 40, 127-34. [all data]
Verevkin and Schick, 2007
Verevkin, Sergey P.; Schick, Christoph,
Vapour pressures and heat capacity measurements on the C7--C9 secondary aliphatic alcohols,
The Journal of Chemical Thermodynamics, 2007, 39, 5, 758-766, https://doi.org/10.1016/j.jct.2006.10.007
. [all data]
Mahmood, Kaul, et al., 2004
Mahmood, U.; Kaul, V.K.; Acharya, R.,
Volatile constituents of Capillipedium parviflorum,
Phytochemistry, 2004, 65, 14, 2163-2166, https://doi.org/10.1016/j.phytochem.2004.04.003
. [all data]
Baser, Özek, et al., 2000
Baser, K.H.C.; Özek, T.; Demirci, B.; Kürkcüoglu, M.; Aytac, Z.; Duman, H.,
Composition of the essential oils of Zosima absinthifolia (Vent.) Link and Ferula elaeochytris Korovin from Turkey,
Flavour Fragr. J., 2000, 15, 6, 371-372, https://doi.org/10.1002/1099-1026(200011/12)15:6<371::AID-FFJ919>3.0.CO;2-Z
. [all data]
Qin, 2009
Qin, Z.,
Relationship between the molecular structure and gas chromatographic retention index of alcohol isomer,
J. Xuzhou Norm. Univ. (Nat. Sci. Edn.), 2009, 27, 2, 88-90. [all data]