trans-Isoeugenol
- Formula: C10H12O2
- Molecular weight: 164.2011
- IUPAC Standard InChIKey: BJIOGJUNALELMI-ONEGZZNKSA-N
- CAS Registry Number: 5932-68-3
- Chemical structure:
View 3d structure (requires JavaScript / HTML 5) - Stereoisomers:
- Other names: Phenol, 2-methoxy-4-(1-propenyl)-, (E)-; Phenol, 2-methoxy-4-propenyl-, (E)-; (E)-Isoeugenol; trans-p-Propenylquaiacol; trans-2-Methoxy-4-propenylphenol; iso-Eugenol 2; Isoeugenol E; 4-(1-Propenyl)-2-methoxyphenol; E-4-Propenyl-2-methoxyphenol; trans-2-Methoxy-4-(1-propenyl)phenol; (E)-2-Methoxy-4-(prop-1-enyl)phenol; NSC 209522; 4-(1-Propenyl)-2-methoxyphenol (trans-isoeugenol)

Phase change data

Data compiled by: William E. Acree, Jr., James S. Chickos
Enthalpy of vaporization
ΔvapH (kJ/mol) | Temperature (K) | Method | Reference | Comment |
---|---|---|---|---|
69.1 | 378. | A | Stephenson and Malanowski, 1987 | Based on data from 363. to 420. K. |

Kovats' RI, non-polar column, isothermal

Data compiled by: NIST Mass Spectrometry Data Center, William E. Wallace, director

Column type Capillary
Active phase SE-30
Column length (m) 40.
Carrier gas
Substrate
Column diameter (mm) 0.35
Phase thickness (μm) 0.35
Temperature (C) 100.
I 1436.4
ReferenceTudor, 1997
Comment MSDC-RI

References

Stephenson and Malanowski, 1987
Stephenson, Richard M.; Malanowski, Stanislaw,
Handbook of the Thermodynamics of Organic Compounds, 1987, https://doi.org/10.1007/978-94-009-3173-2
. [all data]